{"text_format":"1","workbook":"xlsx","n_sheets":15,"sheets":["ETAPA I","ETAPA II.ab","ETAPA II.c","ETAPA II.d","ETAPA II.e","ETAPA II.fg","ETAPA II.h","ETAPA II.i","ETAPA III.a","ETAPA III.a_","ETAPA III.b","ETAPA III.cde","ETAPA IV","ANNEX 1","TABLAS"],"not_rendered":{"charts":0,"images":7,"macros":1,"external_links":0,"defined_names":0,"comments":3,"pivot_tables":0},"unopened":[],"bounds":{"document_bytes":16777216,"sheet_cells":100000,"rows_first":2000,"rows_last":500,"rows_between":2000,"halvings":0,"cell_chars":16384,"cell_head_chars":4096},"cells_cut":0,"cells_raw":0,"read":"whole","date_system":"1900"}

{"sheet":"ETAPA I","index":0,"n_rows":187,"n_cols":6,"rows_kept":187,"cut":false,"hidden":false,"merged":[[183,0,183,5],[184,0,184,5],[185,2,185,5],[187,0,235,5],[2,2,2,5],[10,0,10,5],[46,4,46,5],[59,4,59,5],[5,1,5,5],[72,4,72,5],[130,0,130,5],[131,0,131,5],[132,3,132,5],[134,0,182,5],[25,0,25,5],[75,0,75,5],[22,1,22,5],[27,0,27,2],[28,0,28,5],[31,0,31,2],[76,0,76,5],[77,2,77,5],[84,0,128,5],[32,0,32,5],[29,0,29,5],[33,0,33,5],[80,0,80,5],[81,0,81,5]]}
[null,null,null,null,null,{"$f":"TABLAS!$AL$2","v":"FITXES PER A L'ELABORACIÓ D'UNA ESTRATÈGIA LOCAL DE REHABILITACIÓ DE L'ENTORN CONSTRUÏT"}]
[null,null,null,null,null,{"$f":"TABLAS!$AL$3","v":"ETAPA I: IDENTIFICACIÓ DE L'ÀMBIT"}]
[null,null,{"$f":"TABLAS!$AL$4","v":""}]
["I.a Identificació i abast ",null,null,null,"Data de redacció"]
[]
["Denominació:"]
[]
["Àmbit geogràfic:",null,"Nre. d'hab. afect.:",{"$f":"IF(F39+F52+F65=0,\"\",F39+F52+F65)","v":""},"Superfície afectada km2:",{"$f":"IF(F41+F54+F67=0,\"\",F41+F54+F67)","v":""}]
[]
["Descripció de l’àmbit:"]
[]
[]
["Altres estratègies d'àmbit i/o enfocament temporal més ampli que contemple l'àrea analitzada en les bases estratègiques presents:"]
[]
["  Agenda Urbana Valenciana:"]
[]
["  EDUSI:"]
[]
["  PUAM:"]
[]
["  Pla estratègic municipal:"]
[]
["  Altres (especifiqueu):"]
[]
["Ajudes públiques concedides que afecten l'àrea d'estudi: "]
[]
[]
["El municipi o municipis implicats tenen experiència en gestió de fons europeus?"]
["  En cas afirmatiu, especifiqueu-ne quina o quines:"]
[]
[]
["L'àrea presenta algun tipus o grau de protecció? "]
["  En cas afirmatiu, especifiqueu-ne quin:"]
[]
[]
["I.b  Dades dels municipis implicats"]
[]
["Municipi 1"]
["Denominació:",null,"  Nre. d’habitants:",{"$f":"IFERROR(VLOOKUP('ETAPA I'!$B$39,TABLAS!H:U,5,FALSE),\"\")","v":""},"  Nre. d'habitants afectats:"]
[]
["Província:",{"$f":"IFERROR(VLOOKUP('ETAPA I'!$B$39,TABLAS!H:U,3,FALSE),\"\")","v":""},"  Superfície km2:",{"$f":"IFERROR(VLOOKUP('ETAPA I'!$B$39,TABLAS!H:U,14,FALSE),\"\")","v":""},"  Superfície afectada km2:"]
[]
["Comarca:",{"$f":"IFERROR(VLOOKUP('ETAPA I'!$B$39,TABLAS!H:U,4,FALSE),\"\")","v":""},"  Zona ATPMS:",{"$f":"IFERROR(VLOOKUP('ETAPA I'!$B$39,TABLAS!H:U,13,FALSE),\"\")","v":""}]
[]
["Codi INE:",{"$f":"IFERROR(VLOOKUP('ETAPA I'!$B$39,TABLAS!H:U,2,FALSE),\"\")","v":""}]
[]
["Planejament vigent:",null,"  En desenvolupament o revisió:"]
[]
["Data d’aprovació:"]
[]
["Municipi 2"]
["Denominació:",null,"  Nre. d’habitants:",{"$f":"IFERROR(VLOOKUP('ETAPA I'!$B$52,TABLAS!H:U,5,FALSE),\"\")","v":""},"  Nre. d'habitants afectats:"]
[]
["Província:",{"$f":"IFERROR(VLOOKUP('ETAPA I'!$B$52,TABLAS!H:U,3,FALSE),\"\")","v":""},"  Superfície km2:",{"$f":"IFERROR(VLOOKUP('ETAPA I'!$B$52,TABLAS!H:U,14,FALSE),\"\")","v":""},"  Superfície afectada km2:"]
[]
["Comarca:",{"$f":"IFERROR(VLOOKUP('ETAPA I'!$B$52,TABLAS!H:U,4,FALSE),\"\")","v":""},"  Zona ATPMS:",{"$f":"IFERROR(VLOOKUP('ETAPA I'!$B$52,TABLAS!H:U,13,FALSE),\"\")","v":""}]
[]
["Codi INE:",{"$f":"IFERROR(VLOOKUP('ETAPA I'!$B$52,TABLAS!H:U,2,FALSE),\"\")","v":""}]
[]
["Planejament vigent:",null,"  En desenvolupament o revisió:"]
[]
["Data d’aprovació:"]
[]
["Municipi 3"]
["Denominació:",null,"  Nre. d’habitants:",{"$f":"IFERROR(VLOOKUP('ETAPA I'!$B$65,TABLAS!H:U,5,FALSE),\"\")","v":""},"  Nre. d'habitants afectats:"]
[]
["Província:",{"$f":"IFERROR(VLOOKUP('ETAPA I'!$B$65,TABLAS!H:U,3,FALSE),\"\")","v":""},"  Superfície km2:",{"$f":"IFERROR(VLOOKUP('ETAPA I'!$B$65,TABLAS!H:U,14,FALSE),\"\")","v":""},"  Superfície afectada km2:"]
[]
["Comarca:",{"$f":"IFERROR(VLOOKUP('ETAPA I'!$B$65,TABLAS!H:U,4,FALSE),\"\")","v":""},"  Zona ATPMS:",{"$f":"IFERROR(VLOOKUP('ETAPA I'!$B$65,TABLAS!H:U,13,FALSE),\"\")","v":""}]
[]
["Codi INE:",{"$f":"IFERROR(VLOOKUP('ETAPA I'!$B$65,TABLAS!H:U,2,FALSE),\"\")","v":""}]
[]
["Planejament vigent:",null,"  En desenvolupament o revisió:"]
[]
["Data d’aprovació:"]
[{"$f":"TABLAS!$AL$2","v":"FITXES PER A L'ELABORACIÓ D'UNA ESTRATÈGIA LOCAL DE REHABILITACIÓ DE L'ENTORN CONSTRUÏT"}]
[{"$f":"TABLAS!$AL$3","v":"ETAPA I: IDENTIFICACIÓ DE L'ÀMBIT"}]
[null,null,{"$f":"TABLAS!$AL$4","v":""}]
["I.c  Conclusions extretes del procés participatiu"]
[]
["S'ha aconseguit un elevat grau de consens amb les diferents administracions actuants, així com amb els sectors involucrats de la societat civil (associacions veïnals i ciutadanes, banca, empreses del sector, etc.) per al desenvolupament de les actuacions?"]
[]
[]
["Conclusions:"]
[]
[]
[]
[]
[]
[]
[]
[]
[]
[]
[]
[]
[]
[]
[]
[]
[]
[]
[]
[]
[]
[]
[]
[]
[]
[]
[]
[]
[]
[]
[]
[]
[]
[]
[]
[]
[]
[]
[]
[]
[]
[]
[]
[]
[]
[]
[{"$f":"TABLAS!$AL$2","v":"FITXES PER A L'ELABORACIÓ D'UNA ESTRATÈGIA LOCAL DE REHABILITACIÓ DE L'ENTORN CONSTRUÏT"}]
[{"$f":"TABLAS!$AL$3","v":"ETAPA I: IDENTIFICACIÓ DE L'ÀMBIT"}]
[null,null,null,{"$f":"TABLAS!$AL$4","v":""}]
["I.d  Plànol d'emplaçament"]
[]
[]
[]
[]
[]
[]
[]
[]
[]
[]
[]
[]
[]
[]
[]
[]
[]
[]
[]
[]
[]
[]
[]
[]
[]
[]
[]
[]
[]
[]
[]
[]
[]
[]
[]
[]
[]
[]
[]
[]
[]
[]
[]
[]
[]
[]
[]
[]
[]
[{"$f":"TABLAS!$AL$2","v":"FITXES PER A L'ELABORACIÓ D'UNA ESTRATÈGIA LOCAL DE REHABILITACIÓ DE L'ENTORN CONSTRUÏT"}]
[{"$f":"TABLAS!$AL$3","v":"ETAPA I: IDENTIFICACIÓ DE L'ÀMBIT"}]
[null,null,{"$f":"TABLAS!$AL$4","v":""}]
["I.e  Imatges"]

{"sheet":"ETAPA II.ab","index":1,"n_rows":36,"n_cols":6,"rows_kept":36,"cut":false,"hidden":false,"merged":[[2,3,2,5],[36,0,45,5],[8,0,17,5]]}
[null,null,null,null,null,{"$f":"TABLAS!$AL$2","v":"FITXES PER A L'ELABORACIÓ D'UNA ESTRATÈGIA LOCAL DE REHABILITACIÓ DE L'ENTORN CONSTRUÏT"}]
[null,null,null,null,null,{"$f":"TABLAS!$AL$5","v":"ETAPA II: ANÀLISI I DIAGNÒSTIC"}]
[null,null,null,{"$f":"TABLAS!$AL$4","v":""}]
["II.a Espais urbans sensibles per municipi",null,null,null,null,"Visor d'Espais Urbans Sensibles de la Comunitat Valenciana"]
["Municipi:",{"$f":"IF('ETAPA I'!B39=\"\",\"\",'ETAPA I'!B39)","v":""},null,{"$f":"IF('ETAPA I'!B52=\"\",\"\",'ETAPA I'!B52)","v":""},null,{"$f":"IF('ETAPA I'!B65=\"\",\"\",'ETAPA I'!B65)","v":""}]
["Tipologia de vulnerabilitat:",{"$f":"IFERROR(VLOOKUP('ETAPA I'!$B$39,TABLAS!H:U,7,FALSE),\"\")","v":""},null,{"$f":"IFERROR(VLOOKUP('ETAPA I'!$B$52,TABLAS!H:U,7,FALSE),\"\")","v":""},null,{"$f":"IFERROR(VLOOKUP('ETAPA I'!$B$65,TABLAS!H:U,7,FALSE),\"\")","v":""}]
[]
["Observacions:"]
[]
[]
[]
[]
[]
[]
[]
[]
[]
[]
[]
["II.b  Necessitat d'habitatge i risc de despoblació per municipi",null,null,null,null,"ANHA Àrees de necessitat d’habitatge"]
["Municipi:",{"$f":"IF('ETAPA I'!B39=\"\",\"\",'ETAPA I'!B39)","v":""},null,{"$f":"IF('ETAPA I'!B52=\"\",\"\",'ETAPA I'!B52)","v":""},null,{"$f":"IF('ETAPA I'!B65=\"\",\"\",'ETAPA I'!B65)","v":""}]
["Risc de despoblació:",{"$f":"IFERROR(VLOOKUP('ETAPA I'!$B$39,TABLAS!H:U,6,FALSE),\"\")","v":""},null,{"$f":"IFERROR(VLOOKUP('ETAPA I'!$B$52,TABLAS!H:U,6,FALSE),\"\")","v":""},null,{"$f":"IFERROR(VLOOKUP('ETAPA I'!$B$65,TABLAS!H:U,6,FALSE),\"\")","v":""}]
[]
["Necessitat d'habitatge (ANHA ponderat):",{"$f":"IFERROR(VLOOKUP('ETAPA I'!$B$39,TABLAS!H:U,12,FALSE),\"\")","v":""},null,{"$f":"IFERROR(VLOOKUP('ETAPA I'!$B$52,TABLAS!H:U,12,FALSE),\"\")","v":""},null,{"$f":"IFERROR(VLOOKUP('ETAPA I'!$B$65,TABLAS!H:U,12,FALSE),\"\")","v":""}]
[]
["Nivell de lloguer tensionat:",{"$f":"IFERROR(VLOOKUP('ETAPA I'!$B$39,TABLAS!H:U,11,FALSE),\"\")","v":""},null,{"$f":"IFERROR(VLOOKUP('ETAPA I'!$B$52,TABLAS!H:U,11,FALSE),\"\")","v":""},null,{"$f":"IFERROR(VLOOKUP('ETAPA I'!$B$65,TABLAS!H:U,11,FALSE),\"\")","v":""}]
[]
["Vulnerabilitat inundació:",{"$f":"IFERROR(VLOOKUP('ETAPA I'!$B$39,TABLAS!H:U,9,FALSE),\"\")","v":""},null,{"$f":"IFERROR(VLOOKUP('ETAPA I'!$B$52,TABLAS!H:U,9,FALSE),\"\")","v":""},null,{"$f":"IFERROR(VLOOKUP('ETAPA I'!$B$65,TABLAS!H:U,9,FALSE),\"\")","v":""}]
[]
[" Vulnerabilitat sisme:",{"$f":"IFERROR(VLOOKUP('ETAPA I'!$B$39,TABLAS!H:U,10,FALSE),\"\")","v":""},null,{"$f":"IFERROR(VLOOKUP('ETAPA I'!$B$52,TABLAS!H:U,10,FALSE),\"\")","v":""},null,{"$f":"IFERROR(VLOOKUP('ETAPA I'!$B$65,TABLAS!H:U,10,FALSE),\"\")","v":""}]
[]
["Titularitat dels edificis de l'àrea:"]
[]
["Índex mitjà de pobresa energètica de l'àrea:"]
[]
["Observacions:"]

{"sheet":"ETAPA II.c","index":2,"n_rows":358,"n_cols":10,"rows_kept":358,"cut":false,"hidden":false,"merged":[[358,1,388,9],[326,3,326,9],[318,5,318,9],[320,5,320,9],[322,5,322,9],[292,5,292,9],[298,5,298,9],[300,5,300,9],[302,5,302,9],[308,5,308,9],[295,3,295,5],[305,3,305,5],[315,3,315,5],[348,1,348,10],[261,3,261,5],[275,3,275,5],[285,3,285,5],[248,5,248,9],[254,5,254,9],[256,5,256,9],[258,5,258,9],[264,5,264,9],[266,5,266,9],[280,5,280,9],[282,5,282,9],[288,5,288,9],[290,5,290,9],[310,5,310,9],[312,5,312,9],[202,5,202,9],[204,5,204,9],[210,5,210,9],[278,5,278,9],[234,5,234,9],[236,5,236,9],[238,5,238,9],[244,5,244,9],[246,5,246,9],[231,3,231,5],[241,3,241,5],[221,3,221,5],[212,5,212,9],[214,5,214,9],[272,3,272,9],[268,5,268,9],[224,5,224,9],[226,5,226,9],[228,5,228,9],[251,3,251,5],[62,5,62,9],[64,5,64,9],[66,5,66,9],[146,5,146,9],[148,5,148,9],[150,5,150,9],[156,5,156,9],[99,3,99,5],[89,3,89,5],[190,5,190,9],[192,5,192,9],[158,5,158,9],[160,5,160,9],[170,5,170,9],[172,5,172,9],[174,5,174,9],[69,3,69,5],[79,3,79,5],[3,7,3,9],[35,3,35,5],[45,3,45,5],[59,3,59,5],[5,3,5,5],[15,3,15,5],[25,3,25,5],[8,5,8,9],[10,5,10,9],[12,5,12,9],[22,5,22,9],[28,5,28,9],[30,5,30,9],[32,5,32,9],[38,5,38,9],[194,5,194,9],[200,5,200,9],[84,5,84,9],[86,5,86,9],[92,5,92,9],[94,5,94,9],[96,5,96,9],[113,3,113,5],[104,5,104,9],[123,3,123,5],[180,5,180,9],[133,3,133,5],[143,3,143,5],[130,5,130,9],[136,5,136,9],[138,5,138,9],[140,5,140,9],[106,5,106,9],[116,5,116,9],[118,5,118,9],[120,5,120,9],[126,5,126,9],[182,5,182,9],[184,5,184,9],[2,3,2,9],[18,5,18,9],[20,5,20,9],[56,3,56,9],[110,3,110,9],[164,3,164,9],[218,3,218,9],[102,5,102,9],[153,3,153,5],[167,3,167,5],[177,3,177,5],[187,3,187,5],[197,3,197,5],[207,3,207,5],[72,5,72,9],[74,5,74,9],[40,5,40,9],[42,5,42,9],[48,5,48,9],[50,5,50,9],[52,5,52,9],[128,5,128,9],[76,5,76,9],[82,5,82,9]]}
[null,null,null,null,null,null,null,null,null,{"$f":"TABLAS!$AL$2","v":"FITXES PER A L'ELABORACIÓ D'UNA ESTRATÈGIA LOCAL DE REHABILITACIÓ DE L'ENTORN CONSTRUÏT"}]
[null,null,null,null,null,null,null,null,null,{"$f":"TABLAS!$AL$5","v":"ETAPA II: ANÀLISI I DIAGNÒSTIC"}]
[null,null,null,{"$f":"TABLAS!$AL$4","v":""}]
["II.c  Estat del parc edificatori municipal",null,null,null,null,"Nre. d'edificis:",null,5]
[null,"Edifici",null,"Direcció",null,null,null,"Superfície",null,"Any cons."]
["E.1"]
[null,"Avaluació de l'estat de conservació",null,"Avaluació de l'accessibilitat",null,"Avaluació de l'eficiència energètica "]
[null,"Es troba en ús?",null,"Presenta barreres arquitectòniques?",null,"Certificat d'eficiència energètica de l'edifici"]
[]
[null,"Nivell de manteniment",null,"Si hi ha barreres arquitectòniques, descriviu-les",null,"Necessitat de millorar l'envolupant tèrmica"]
[]
[null,"Estat de conservació",null,"Si no té ascensor, és possible instal·lar-lo?",null,"Necessitat d'actualitzar les instal·lacions tèrmiques"]
[]
[]
[null,"Edifici",null,"Direcció",null,null,null,"Superfície",null,"Any cons."]
["E.2"]
[null,"Avaluació de l'estat de conservació",null,"Avaluació de l'accessibilitat",null,"Avaluació de l'eficiència energètica "]
[null,"Es troba en ús?",null,"Presenta barreres arquitectòniques?",null,"Certificat d'eficiència energètica de l'edifici"]
[]
[null,"Nivell de manteniment",null,"Si hi ha barreres arquitectòniques, descriviu-les",null,"Necessitat de millorar l'envolupant tèrmica"]
[]
[null,"Estat de conservació",null,"Si no té ascensor, és possible instal·lar-lo?",null,"Necessitat d'actualitzar les instal·lacions tèrmiques"]
[]
[]
[null,"Edifici",null,"Direcció",null,null,null,"Superfície",null,"Any cons."]
["E.3"]
[null,"Avaluació de l'estat de conservació",null,"Avaluació de l'accessibilitat",null,"Avaluació de l'eficiència energètica "]
[null,"Es troba en ús?",null,"Presenta barreres arquitectòniques?",null,"Certificat d'eficiència energètica de l'edifici"]
[]
[null,"Nivell de manteniment",null,"Si hi ha barreres arquitectòniques, descriviu-les",null,"Necessitat de millorar l'envolupant tèrmica"]
[]
[null,"Estat de conservació",null,"Si no té ascensor, és possible instal·lar-lo?",null,"Necessitat d'actualitzar les instal·lacions tèrmiques"]
[]
[]
[null,"Edifici",null,"Direcció",null,null,null,"Superfície",null,"Any cons."]
["E.4"]
[null,"Avaluació de l'estat de conservació",null,"Avaluació de l'accessibilitat",null,"Avaluació de l'eficiència energètica "]
[null,"Es troba en ús?",null,"Presenta barreres arquitectòniques?",null,"Certificat d'eficiència energètica de l'edifici"]
[]
[null,"Nivell de manteniment",null,"Si hi ha barreres arquitectòniques, descriviu-les",null,"Necessitat de millorar l'envolupant tèrmica"]
[]
[null,"Estat de conservació",null,"Si no té ascensor, és possible instal·lar-lo?",null,"Necessitat d'actualitzar les instal·lacions tèrmiques"]
[]
[]
[null,"Edifici",null,"Direcció",null,null,null,"Superfície",null,"Any cons."]
["E.5"]
[null,"Avaluació de l'estat de conservació",null,"Avaluació de l'accessibilitat",null,"Avaluació de l'eficiència energètica "]
[null,"Es troba en ús?",null,"Presenta barreres arquitectòniques?",null,"Certificat d'eficiència energètica de l'edifici"]
[]
[null,"Nivell de manteniment",null,"Si hi ha barreres arquitectòniques, descriviu-les",null,"Necessitat de millorar l'envolupant tèrmica"]
[]
[null,"Estat de conservació",null,"Si no té ascensor, és possible instal·lar-lo?",null,"Necessitat d'actualitzar les instal·lacions tèrmiques"]
[]
[]
[null,null,null,null,null,null,null,null,null,{"$f":"TABLAS!$AL$2","v":"FITXES PER A L'ELABORACIÓ D'UNA ESTRATÈGIA LOCAL DE REHABILITACIÓ DE L'ENTORN CONSTRUÏT"}]
[null,null,null,null,null,null,null,null,null,{"$f":"IF($J$2=\"\",\"\",$J$2)","v":"ETAPA II: ANÀLISI I DIAGNÒSTIC"}]
[null,null,null,{"$f":"TABLAS!$AL$4","v":""}]
[]
[null,"Edifici",null,"Direcció",null,null,null,"Superfície",null,"Any cons."]
["E.6"]
[null,"Avaluació de l'estat de conservació",null,"Avaluació de l'accessibilitat",null,"Avaluació de l'eficiència energètica "]
[null,"Es troba en ús?",null,"Presenta barreres arquitectòniques?",null,"Certificat d'eficiència energètica de l'edifici"]
[]
[null,"Nivell de manteniment",null,"Si hi ha barreres arquitectòniques, descriviu-les",null,"Necessitat de millorar l'envolupant tèrmica"]
[]
[null,"Estat de conservació",null,"Si no té ascensor, és possible instal·lar-lo?",null,"Necessitat d'actualitzar les instal·lacions tèrmiques"]
[]
[]
[null,"Edifici",null,"Direcció",null,null,null,"Superfície",null,"Any cons."]
["E.7"]
[null,"Avaluació de l'estat de conservació",null,"Avaluació de l'accessibilitat",null,"Avaluació de l'eficiència energètica "]
[null,"Es troba en ús?",null,"Presenta barreres arquitectòniques?",null,"Certificat d'eficiència energètica de l'edifici"]
[]
[null,"Nivell de manteniment",null,"Si hi ha barreres arquitectòniques, descriviu-les",null,"Necessitat de millorar l'envolupant tèrmica"]
[]
[null,"Estat de conservació",null,"Si no té ascensor, és possible instal·lar-lo?",null,"Necessitat d'actualitzar les instal·lacions tèrmiques"]
[]
[]
[null,"Edifici",null,"Direcció",null,null,null,"Superfície",null,"Any cons."]
["E.8"]
[null,"Avaluació de l'estat de conservació",null,"Avaluació de l'accessibilitat",null,"Avaluació de l'eficiència energètica "]
[null,"Es troba en ús?",null,"Presenta barreres arquitectòniques?",null,"Certificat d'eficiència energètica de l'edifici"]
[]
[null,"Nivell de manteniment",null,"Si hi ha barreres arquitectòniques, descriviu-les",null,"Necessitat de millorar l'envolupant tèrmica"]
[]
[null,"Estat de conservació",null,"Si no té ascensor, és possible instal·lar-lo?",null,"Necessitat d'actualitzar les instal·lacions tèrmiques"]
[]
[]
[null,"Edifici",null,"Direcció",null,null,null,"Superfície",null,"Any cons."]
["E.9"]
[null,"Avaluació de l'estat de conservació",null,"Avaluació de l'accessibilitat",null,"Avaluació de l'eficiència energètica "]
[null,"Es troba en ús?",null,"Presenta barreres arquitectòniques?",null,"Certificat d'eficiència energètica de l'edifici"]
[]
[null,"Nivell de manteniment",null,"Si hi ha barreres arquitectòniques, descriviu-les",null,"Necessitat de millorar l'envolupant tèrmica"]
[]
[null,"Estat de conservació",null,"Si no té ascensor, és possible instal·lar-lo?",null,"Necessitat d'actualitzar les instal·lacions tèrmiques"]
[]
[]
[null,"Edifici",null,"Direcció",null,null,null,"Superfície",null,"Any cons."]
["E.10"]
[null,"Avaluació de l'estat de conservació",null,"Avaluació de l'accessibilitat",null,"Avaluació de l'eficiència energètica "]
[null,"Es troba en ús?",null,"Presenta barreres arquitectòniques?",null,"Certificat d'eficiència energètica de l'edifici"]
[]
[null,"Nivell de manteniment",null,"Si hi ha barreres arquitectòniques, descriviu-les",null,"Necessitat de millorar l'envolupant tèrmica"]
[]
[null,"Estat de conservació",null,"Si no té ascensor, és possible instal·lar-lo?",null,"Necessitat d'actualitzar les instal·lacions tèrmiques"]
[]
[]
[null,null,null,null,null,null,null,null,null,{"$f":"TABLAS!$AL$2","v":"FITXES PER A L'ELABORACIÓ D'UNA ESTRATÈGIA LOCAL DE REHABILITACIÓ DE L'ENTORN CONSTRUÏT"}]
[null,null,null,null,null,null,null,null,null,{"$f":"IF($J$2=\"\",\"\",$J$2)","v":"ETAPA II: ANÀLISI I DIAGNÒSTIC"}]
[null,null,null,{"$f":"TABLAS!$AL$4","v":""}]
[]
[null,"Edifici",null,"Direcció",null,null,null,"Superfície",null,"Any cons."]
["E.11"]
[null,"Avaluació de l'estat de conservació",null,"Avaluació de l'accessibilitat",null,"Avaluació de l'eficiència energètica "]
[null,"Es troba en ús?",null,"Presenta barreres arquitectòniques?",null,"Certificat d'eficiència energètica de l'edifici"]
[]
[null,"Nivell de manteniment",null,"Si hi ha barreres arquitectòniques, descriviu-les",null,"Necessitat de millorar l'envolupant tèrmica"]
[]
[null,"Estat de conservació",null,"Si no té ascensor, és possible instal·lar-lo?",null,"Necessitat d'actualitzar les instal·lacions tèrmiques"]
[]
[]
[null,"Edifici",null,"Direcció",null,null,null,"Superfície",null,"Any cons."]
["E.12"]
[null,"Avaluació de l'estat de conservació",null,"Avaluació de l'accessibilitat",null,"Avaluació de l'eficiència energètica "]
[null,"Es troba en ús?",null,"Presenta barreres arquitectòniques?",null,"Certificat d'eficiència energètica de l'edifici"]
[]
[null,"Nivell de manteniment",null,"Si hi ha barreres arquitectòniques, descriviu-les",null,"Necessitat de millorar l'envolupant tèrmica"]
[]
[null,"Estat de conservació",null,"Si no té ascensor, és possible instal·lar-lo?",null,"Necessitat d'actualitzar les instal·lacions tèrmiques"]
[]
[]
[null,"Edifici",null,"Direcció",null,null,null,"Superfície",null,"Any cons."]
["E.13"]
[null,"Avaluació de l'estat de conservació",null,"Avaluació de l'accessibilitat",null,"Avaluació de l'eficiència energètica "]
[null,"Es troba en ús?",null,"Presenta barreres arquitectòniques?",null,"Certificat d'eficiència energètica de l'edifici"]
[]
[null,"Nivell de manteniment",null,"Si hi ha barreres arquitectòniques, descriviu-les",null,"Necessitat de millorar l'envolupant tèrmica"]
[]
[null,"Estat de conservació",null,"Si no té ascensor, és possible instal·lar-lo?",null,"Necessitat d'actualitzar les instal·lacions tèrmiques"]
[]
[]
[null,"Edifici",null,"Direcció",null,null,null,"Superfície",null,"Any cons."]
["E.14"]
[null,"Avaluació de l'estat de conservació",null,"Avaluació de l'accessibilitat",null,"Avaluació de l'eficiència energètica "]
[null,"Es troba en ús?",null,"Presenta barreres arquitectòniques?",null,"Certificat d'eficiència energètica de l'edifici"]
[]
[null,"Nivell de manteniment",null,"Si hi ha barreres arquitectòniques, descriviu-les",null,"Necessitat de millorar l'envolupant tèrmica"]
[]
[null,"Estat de conservació",null,"Si no té ascensor, és possible instal·lar-lo?",null,"Necessitat d'actualitzar les instal·lacions tèrmiques"]
[]
[]
[null,"Edifici",null,"Direcció",null,null,null,"Superfície",null,"Any cons."]
["E.15"]
[null,"Avaluació de l'estat de conservació",null,"Avaluació de l'accessibilitat",null,"Avaluació de l'eficiència energètica "]
[null,"Es troba en ús?",null,"Presenta barreres arquitectòniques?",null,"Certificat d'eficiència energètica de l'edifici"]
[]
[null,"Nivell de manteniment",null,"Si hi ha barreres arquitectòniques, descriviu-les",null,"Necessitat de millorar l'envolupant tèrmica"]
[]
[null,"Estat de conservació",null,"Si no té ascensor, és possible instal·lar-lo?",null,"Necessitat d'actualitzar les instal·lacions tèrmiques"]
[]
[]
[null,null,null,null,null,null,null,null,null,{"$f":"TABLAS!$AL$2","v":"FITXES PER A L'ELABORACIÓ D'UNA ESTRATÈGIA LOCAL DE REHABILITACIÓ DE L'ENTORN CONSTRUÏT"}]
[null,null,null,null,null,null,null,null,null,{"$f":"IF($J$2=\"\",\"\",$J$2)","v":"ETAPA II: ANÀLISI I DIAGNÒSTIC"}]
[null,null,null,{"$f":"TABLAS!$AL$4","v":""}]
[]
[null,"Edifici",null,"Direcció",null,null,null,"Superfície",null,"Any cons."]
["E.16"]
[null,"Avaluació de l'estat de conservació",null,"Avaluació de l'accessibilitat",null,"Avaluació de l'eficiència energètica "]
[null,"Es troba en ús?",null,"Presenta barreres arquitectòniques?",null,"Certificat d'eficiència energètica de l'edifici"]
[]
[null,"Nivell de manteniment",null,"Si hi ha barreres arquitectòniques, descriviu-les",null,"Necessitat de millorar l'envolupant tèrmica"]
[]
[null,"Estat de conservació",null,"Si no té ascensor, és possible instal·lar-lo?",null,"Necessitat d'actualitzar les instal·lacions tèrmiques"]
[]
[]
[null,"Edifici",null,"Direcció",null,null,null,"Superfície",null,"Any cons."]
["E.17"]
[null,"Avaluació de l'estat de conservació",null,"Avaluació de l'accessibilitat",null,"Avaluació de l'eficiència energètica "]
[null,"Es troba en ús?",null,"Presenta barreres arquitectòniques?",null,"Certificat d'eficiència energètica de l'edifici"]
[]
[null,"Nivell de manteniment",null,"Si hi ha barreres arquitectòniques, descriviu-les",null,"Necessitat de millorar l'envolupant tèrmica"]
[]
[null,"Estat de conservació",null,"Si no té ascensor, és possible instal·lar-lo?",null,"Necessitat d'actualitzar les instal·lacions tèrmiques"]
[]
[]
[null,"Edifici",null,"Direcció",null,null,null,"Superfície",null,"Any cons."]
["E.18"]
[null,"Avaluació de l'estat de conservació",null,"Avaluació de l'accessibilitat",null,"Avaluació de l'eficiència energètica "]
[null,"Es troba en ús?",null,"Presenta barreres arquitectòniques?",null,"Certificat d'eficiència energètica de l'edifici"]
[]
[null,"Nivell de manteniment",null,"Si hi ha barreres arquitectòniques, descriviu-les",null,"Necessitat de millorar l'envolupant tèrmica"]
[]
[null,"Estat de conservació",null,"Si no té ascensor, és possible instal·lar-lo?",null,"Necessitat d'actualitzar les instal·lacions tèrmiques"]
[]
[]
[null,"Edifici",null,"Direcció",null,null,null,"Superfície",null,"Any cons."]
["E.19"]
[null,"Avaluació de l'estat de conservació",null,"Avaluació de l'accessibilitat",null,"Avaluació de l'eficiència energètica "]
[null,"Es troba en ús?",null,"Presenta barreres arquitectòniques?",null,"Certificat d'eficiència energètica de l'edifici"]
[]
[null,"Nivell de manteniment",null,"Si hi ha barreres arquitectòniques, descriviu-les",null,"Necessitat de millorar l'envolupant tèrmica"]
[]
[null,"Estat de conservació",null,"Si no té ascensor, és possible instal·lar-lo?",null,"Necessitat d'actualitzar les instal·lacions tèrmiques"]
[]
[]
[null,"Edifici",null,"Direcció",null,null,null,"Superfície",null,"Any cons."]
["E.20"]
[null,"Avaluació de l'estat de conservació",null,"Avaluació de l'accessibilitat",null,"Avaluació de l'eficiència energètica "]
[null,"Es troba en ús?",null,"Presenta barreres arquitectòniques?",null,"Certificat d'eficiència energètica de l'edifici"]
[]
[null,"Nivell de manteniment",null,"Si hi ha barreres arquitectòniques, descriviu-les",null,"Necessitat de millorar l'envolupant tèrmica"]
[]
[null,"Estat de conservació",null,"Si no té ascensor, és possible instal·lar-lo?",null,"Necessitat d'actualitzar les instal·lacions tèrmiques"]
[]
[]
[null,null,null,null,null,null,null,null,null,{"$f":"TABLAS!$AL$2","v":"FITXES PER A L'ELABORACIÓ D'UNA ESTRATÈGIA LOCAL DE REHABILITACIÓ DE L'ENTORN CONSTRUÏT"}]
[null,null,null,null,null,null,null,null,null,{"$f":"IF($J$2=\"\",\"\",$J$2)","v":"ETAPA II: ANÀLISI I DIAGNÒSTIC"}]
[null,null,null,{"$f":"TABLAS!$AL$4","v":""}]
[]
[null,"Edifici",null,"Direcció",null,null,null,"Superfície",null,"Any cons."]
["E.21"]
[null,"Avaluació de l'estat de conservació",null,"Avaluació de l'accessibilitat",null,"Avaluació de l'eficiència energètica "]
[null,"Es troba en ús?",null,"Presenta barreres arquitectòniques?",null,"Certificat d'eficiència energètica de l'edifici"]
[]
[null,"Nivell de manteniment",null,"Si hi ha barreres arquitectòniques, descriviu-les",null,"Necessitat de millorar l'envolupant tèrmica"]
[]
[null,"Estat de conservació",null,"Si no té ascensor, és possible instal·lar-lo?",null,"Necessitat d'actualitzar les instal·lacions tèrmiques"]
[]
[]
[null,"Edifici",null,"Direcció",null,null,null,"Superfície",null,"Any cons."]
["E.22"]
[null,"Avaluació de l'estat de conservació",null,"Avaluació de l'accessibilitat",null,"Avaluació de l'eficiència energètica "]
[null,"Es troba en ús?",null,"Presenta barreres arquitectòniques?",null,"Certificat d'eficiència energètica de l'edifici"]
[]
[null,"Nivell de manteniment",null,"Si hi ha barreres arquitectòniques, descriviu-les",null,"Necessitat de millorar l'envolupant tèrmica"]
[]
[null,"Estat de conservació",null,"Si no té ascensor, és possible instal·lar-lo?",null,"Necessitat d'actualitzar les instal·lacions tèrmiques"]
[]
[]
[null,"Edifici",null,"Direcció",null,null,null,"Superfície",null,"Any cons."]
["E.23"]
[null,"Avaluació de l'estat de conservació",null,"Avaluació de l'accessibilitat",null,"Avaluació de l'eficiència energètica "]
[null,"Es troba en ús?",null,"Presenta barreres arquitectòniques?",null,"Certificat d'eficiència energètica de l'edifici"]
[]
[null,"Nivell de manteniment",null,"Si hi ha barreres arquitectòniques, descriviu-les",null,"Necessitat de millorar l'envolupant tèrmica"]
[]
[null,"Estat de conservació",null,"Si no té ascensor, és possible instal·lar-lo?",null,"Necessitat d'actualitzar les instal·lacions tèrmiques"]
[]
[]
[null,"Edifici",null,"Direcció",null,null,null,"Superfície",null,"Any cons."]
["E.24"]
[null,"Avaluació de l'estat de conservació",null,"Avaluació de l'accessibilitat",null,"Avaluació de l'eficiència energètica "]
[null,"Es troba en ús?",null,"Presenta barreres arquitectòniques?",null,"Certificat d'eficiència energètica de l'edifici"]
[]
[null,"Nivell de manteniment",null,"Si hi ha barreres arquitectòniques, descriviu-les",null,"Necessitat de millorar l'envolupant tèrmica"]
[]
[null,"Estat de conservació",null,"Si no té ascensor, és possible instal·lar-lo?",null,"Necessitat d'actualitzar les instal·lacions tèrmiques"]
[]
[]
[null,"Edifici",null,"Direcció",null,null,null,"Superfície",null,"Any cons."]
["E.25"]
[null,"Avaluació de l'estat de conservació",null,"Avaluació de l'accessibilitat",null,"Avaluació de l'eficiència energètica "]
[null,"Es troba en ús?",null,"Presenta barreres arquitectòniques?",null,"Certificat d'eficiència energètica de l'edifici"]
[]
[null,"Nivell de manteniment",null,"Si hi ha barreres arquitectòniques, descriviu-les",null,"Necessitat de millorar l'envolupant tèrmica"]
[]
[null,"Estat de conservació",null,"Si no té ascensor, és possible instal·lar-lo?",null,"Necessitat d'actualitzar les instal·lacions tèrmiques"]
[]
[]
[null,null,null,null,null,null,null,null,null,{"$f":"TABLAS!$AL$2","v":"FITXES PER A L'ELABORACIÓ D'UNA ESTRATÈGIA LOCAL DE REHABILITACIÓ DE L'ENTORN CONSTRUÏT"}]
[null,null,null,null,null,null,null,null,null,{"$f":"IF($J$2=\"\",\"\",$J$2)","v":"ETAPA II: ANÀLISI I DIAGNÒSTIC"}]
[null,null,null,{"$f":"TABLAS!$AL$4","v":""}]
[]
[null,"Edifici",null,"Direcció",null,null,null,"Superfície",null,"Any cons."]
["E.26"]
[null,"Avaluació de l'estat de conservació",null,"Avaluació de l'accessibilitat",null,"Avaluació de l'eficiència energètica "]
[null,"Es troba en ús?",null,"Presenta barreres arquitectòniques?",null,"Certificat d'eficiència energètica de l'edifici"]
[]
[null,"Nivell de manteniment",null,"Si hi ha barreres arquitectòniques, descriviu-les",null,"Necessitat de millorar l'envolupant tèrmica"]
[]
[null,"Estat de conservació",null,"Si no té ascensor, és possible instal·lar-lo?",null,"Necessitat d'actualitzar les instal·lacions tèrmiques"]
[]
[]
[null,"Edifici",null,"Direcció",null,null,null,"Superfície",null,"Any cons."]
["E.27"]
[null,"Avaluació de l'estat de conservació",null,"Avaluació de l'accessibilitat",null,"Avaluació de l'eficiència energètica "]
[null,"Es troba en ús?",null,"Presenta barreres arquitectòniques?",null,"Certificat d'eficiència energètica de l'edifici"]
[]
[null,"Nivell de manteniment",null,"Si hi ha barreres arquitectòniques, descriviu-les",null,"Necessitat de millorar l'envolupant tèrmica"]
[]
[null,"Estat de conservació",null,"Si no té ascensor, és possible instal·lar-lo?",null,"Necessitat d'actualitzar les instal·lacions tèrmiques"]
[]
[]
[null,"Edifici",null,"Direcció",null,null,null,"Superfície",null,"Any cons."]
["E.28"]
[null,"Avaluació de l'estat de conservació",null,"Avaluació de l'accessibilitat",null,"Avaluació de l'eficiència energètica "]
[null,"Es troba en ús?",null,"Presenta barreres arquitectòniques?",null,"Certificat d'eficiència energètica de l'edifici"]
[]
[null,"Nivell de manteniment",null,"Si hi ha barreres arquitectòniques, descriviu-les",null,"Necessitat de millorar l'envolupant tèrmica"]
[]
[null,"Estat de conservació",null,"Si no té ascensor, és possible instal·lar-lo?",null,"Necessitat d'actualitzar les instal·lacions tèrmiques"]
[]
[]
[null,"Edifici",null,"Direcció",null,null,null,"Superfície",null,"Any cons."]
["E.29"]
[null,"Avaluació de l'estat de conservació",null,"Avaluació de l'accessibilitat",null,"Avaluació de l'eficiència energètica "]
[null,"Es troba en ús?",null,"Presenta barreres arquitectòniques?",null,"Certificat d'eficiència energètica de l'edifici"]
[]
[null,"Nivell de manteniment",null,"Si hi ha barreres arquitectòniques, descriviu-les",null,"Necessitat de millorar l'envolupant tèrmica"]
[]
[null,"Estat de conservació",null,"Si no té ascensor, és possible instal·lar-lo?",null,"Necessitat d'actualitzar les instal·lacions tèrmiques"]
[]
[]
[null,"Edifici",null,"Direcció",null,null,null,"Superfície",null,"Any cons."]
["E.30"]
[null,"Avaluació de l'estat de conservació",null,"Avaluació de l'accessibilitat",null,"Avaluació de l'eficiència energètica "]
[null,"Es troba en ús?",null,"Presenta barreres arquitectòniques?",null,"Certificat d'eficiència energètica de l'edifici"]
[]
[null,"Nivell de manteniment",null,"Si hi ha barreres arquitectòniques, descriviu-les",null,"Necessitat de millorar l'envolupant tèrmica"]
[]
[null,"Estat de conservació",null,"Si no té ascensor, és possible instal·lar-lo?",null,"Necessitat d'actualitzar les instal·lacions tèrmiques"]
[]
[]
[null,null,null,null,null,null,null,null,null,{"$f":"TABLAS!$AL$2","v":"FITXES PER A L'ELABORACIÓ D'UNA ESTRATÈGIA LOCAL DE REHABILITACIÓ DE L'ENTORN CONSTRUÏT"}]
[null,null,null,null,null,null,null,null,null,{"$f":"IF($J$2=\"\",\"\",$J$2)","v":"ETAPA II: ANÀLISI I DIAGNÒSTIC"}]
[null,null,null,{"$f":"TABLAS!$AL$4","v":""}]
[]
[null,"Dades dels edificis d'habitatges municipals:"]
[]
[null,"Nre. d'edificis"]
[]
[null,"Tipologia edificatòria majoritària:"]
[]
[null,"Antiguitat majoritària:"]
[]
[null,"Superfície total construïda m²:"]
[]
[null,"Estat de conservació majoritari:"]
[]
[null,"Hi ha edificis catalogats com a BIC?"]
[]
[null,"Nre. total d'habitatges:"]
[]
[null,"Destinades a lloguer assequible:"]
[]
[null,"Destinades a lloguer social:"]
[]
[null,"Dades d'edificis d'habitatges d'altres administracions:"]
[null,"Nre. d'edificis"]
[]
[null,"Estat de conservació majoritari:"]
[]
[null,"Nre. total d'habitatges:"]
[]
[null,"Hi ha edificis catalogats com a BIC?"]
[]
[null,"Observacions:"]

{"sheet":"ETAPA II.d","index":3,"n_rows":48,"n_cols":4,"rows_kept":48,"cut":false,"hidden":false,"merged":[[48,0,52,3]]}
[null,null,null,{"$f":"TABLAS!$AL$2","v":"FITXES PER A L'ELABORACIÓ D'UNA ESTRATÈGIA LOCAL DE REHABILITACIÓ DE L'ENTORN CONSTRUÏT"}]
[null,null,null,{"$f":"TABLAS!$AL$5","v":"ETAPA II: ANÀLISI I DIAGNÒSTIC"}]
[null,null,null,{"$f":"TABLAS!$AL$4","v":""}]
["II.d Inventari de solars municipals"]
[]
["Identificació, ubicació","Calificació/ús ","Superfície\nm2","Edificabilitat\nm2"]
[]
[]
[]
[]
[]
[]
[]
[]
[]
[]
[]
[]
[]
[]
[]
[]
[]
[]
[]
[]
[]
[]
[]
[]
[]
[]
[]
[]
[]
[]
[]
[]
[]
[]
[]
[]
[]
[]
[]
[]
[]
["Observacions:"]

{"sheet":"ETAPA II.e","index":4,"n_rows":46,"n_cols":10,"rows_kept":46,"cut":false,"hidden":false,"merged":[[46,0,53,9],[2,4,2,9],[5,0,6,0],[5,1,6,1],[5,2,6,2],[5,3,5,9],[43,3,43,5]]}
[null,null,null,null,null,null,null,null,null,{"$f":"TABLAS!$AL$2","v":"FITXES PER A L'ELABORACIÓ D'UNA ESTRATÈGIA LOCAL DE REHABILITACIÓ DE L'ENTORN CONSTRUÏT"}]
[null,null,null,null,null,null,null,null,null,{"$f":"TABLAS!$AL$5","v":"ETAPA II: ANÀLISI I DIAGNÒSTIC"}]
[null,null,null,null,{"$f":"TABLAS!$AL$4","v":""}]
["II.e Estat de la urbanització de l'àmbit"]
[]
["Denominació de l'element urbà","Qualitat de disseny ","Accessibilitat i perspectiva de gènere","Estat de conservació"]
[null,null,null,"Xarxa de sanejament","Calçada","Paviment per als vianants","Mobiliari urbà","Vegetació","Enllumenat\nSenyalització","Telecomunicacions"]
[]
[]
[]
[]
[]
[]
[]
[]
[]
[]
[]
[]
[]
[]
[]
[]
[]
[]
[]
[]
[]
[]
[]
[]
[]
[]
[]
[]
[]
[]
[]
[]
[]
[]
[]
[]
["Estat de conservació majoritari dels espais urbans:"]
[]
["Observacions:"]

{"sheet":"ETAPA II.fg","index":5,"n_rows":87,"n_cols":5,"rows_kept":87,"cut":false,"hidden":false,"merged":[[87,0,127,4],[2,2,2,4],[84,0,85,0],[15,3,17,3],[52,0,70,4],[73,2,73,4]]}
[null,null,null,null,{"$f":"TABLAS!$AL$2","v":"FITXES PER A L'ELABORACIÓ D'UNA ESTRATÈGIA LOCAL DE REHABILITACIÓ DE L'ENTORN CONSTRUÏT"}]
[null,null,null,null,{"$f":"TABLAS!$AL$5","v":"ETAPA II: ANÀLISI I DIAGNÒSTIC"}]
[null,null,{"$f":"TABLAS!$AL$4","v":""}]
["II.f  Estat del parc privat residencial"]
[]
["Dades generals:",null,null,"Edificis d'habitatges sense IEE i solars residencials:"]
[]
["Nre. d'edificis",null,null,"Nre. d'edificis en mal estat, en ús"]
[]
["Tipologia edificatòria majoritària",null,null,"Dels quals, tenen ordre d'execució"]
[]
["Antiguitat majoritària",null,null,"Nre. d'edificis ruïnosos, en desús"]
[]
["Superfície total construïda m²",null,null,"Dels quals, tenen ordre d'execució"]
[]
["Estat de conservació majoritari",null,null,"Nre. de solars (sòl amb qualificació “residencial”)"]
[]
["Nre. total d'habitatges"]
[]
["Hi ha edificis catalogats com a BIC?"]
[]
["Informació relativa al IEEv.CV"]
[]
["Nre. d'edificis de més de 50 anys",null,null,"Nre. d'edificis d'habitatges de més de 50 anys amb IEEV.CV registrat"]
[]
["Nre. d''habitatges de més de 50 anys",null,null,"Nre. d'edificis d'habitatges de més de 50 anys amb IEEV.CV registrat"]
[]
[null,null,null,"Dades extretes dels IEEv.CV registrats:"]
[]
[null,null,null,"Presenten riscos imminents"]
[]
[null,null,null,"Requereixen intervencions de conservació de caràcter urgent"]
[]
[null,null,null,"Requereixen intervencions de conservació a mitjà termini"]
[]
[null,null,null,"Presenta barreres arquitectòniques"]
[]
[null,null,null,"Amb qualificació energètica A"]
[]
[null,null,null,"Amb qualificació energètica B"]
[]
[null,null,null,"Amb qualificació energètica C"]
[]
[null,null,null,"Amb qualificació energètica D"]
[]
[null,null,null,"Amb qualificació energètica E"]
[]
[null,null,null,"Amb qualificació energètica F"]
[]
[null,null,null,"Amb qualificació energètica G"]
[]
["Observacions:"]
[]
[]
[]
[]
[]
[]
[]
[]
[]
[]
[]
[]
[]
[]
[]
[]
[]
[]
[]
[null,null,null,null,{"$f":"TABLAS!$AL$2","v":"FITXES PER A L'ELABORACIÓ D'UNA ESTRATÈGIA LOCAL DE REHABILITACIÓ DE L'ENTORN CONSTRUÏT"}]
[null,null,null,null,{"$f":"TABLAS!$AL$5","v":"ETAPA II: ANÀLISI I DIAGNÒSTIC"}]
[null,null,{"$f":"TABLAS!$AL$4","v":""}]
["II.g Estat del parc privat no residencial"]
[]
["Nre. d'edificis en mal estat, en ús"]
[]
["Dels quals, tenen ordre d'execució"]
[]
["Nre. d'edificis ruïnosos, en desús"]
[]
["Dels quals, tenen ordre d'execució"]
[]
["Nre. de solars (sòl amb qualificació diferent a “residencial”)"]
[]
["Observacions:"]

{"sheet":"ETAPA II.h","index":6,"n_rows":505,"n_cols":7,"rows_kept":505,"cut":false,"hidden":false,"merged":[[504,2,505,2],[507,2,508,2],[507,6,508,6],[510,2,511,2],[510,6,511,6],[498,2,499,2],[498,6,499,6],[500,2,501,2],[500,6,501,6],[502,2,503,2],[502,6,503,6],[492,2,493,2],[492,6,493,6],[494,2,495,2],[494,6,495,6],[496,2,497,2],[496,6,497,6],[484,2,485,2],[484,6,485,6],[487,2,488,2],[487,6,488,6],[490,0,490,2],[490,4,490,6],[477,2,478,2],[477,6,478,6],[480,2,481,2],[480,6,481,6],[482,2,483,2],[482,6,483,6],[468,2,469,2],[468,3,489,3],[468,6,469,6],[469,0,469,1],[470,2,471,2],[470,6,471,6],[472,2,473,2],[472,6,473,6],[474,2,475,2],[474,6,475,6],[458,2,459,2],[458,6,459,6],[462,0,462,6],[465,0,465,1],[466,0,466,2],[466,4,466,6],[451,2,452,2],[451,6,452,6],[453,2,454,2],[453,6,454,6],[455,2,456,2],[455,6,456,6],[445,2,446,2],[445,6,446,6],[447,2,448,2],[447,6,448,6],[449,2,450,2],[449,6,450,6],[439,0,439,2],[439,4,439,6],[441,2,442,2],[441,6,442,6],[443,2,444,2],[443,6,444,6],[429,2,430,2],[429,6,430,6],[432,2,433,2],[432,6,433,6],[436,2,437,2],[436,6,437,6],[423,2,424,2],[423,6,424,6],[425,2,426,2],[425,6,426,6],[427,2,428,2],[427,6,428,6],[415,0,415,2],[415,4,415,6],[417,2,418,2],[417,3,438,3],[417,6,418,6],[418,0,418,1],[419,2,420,2],[419,6,420,6],[421,2,422,2],[421,6,422,6],[405,2,406,2],[405,6,406,6],[408,2,409,2],[408,6,409,6],[411,0,411,6],[414,0,414,1],[398,2,399,2],[398,6,399,6],[400,2,401,2],[400,6,401,6],[403,2,404,2],[403,6,404,6],[392,2,393,2],[392,6,393,6],[394,2,395,2],[394,6,395,6],[396,2,397,2],[396,6,397,6],[385,2,386,2],[385,6,386,6],[388,0,388,2],[388,4,388,6],[390,2,391,2],[390,6,391,6],[360,0,360,6],[363,0,363,1],[364,0,364,2],[364,4,364,6],[366,2,367,2],[366,3,387,3],[366,6,367,6],[367,0,367,1],[368,2,369,2],[368,6,369,6],[376,2,377,2],[376,6,377,6],[379,2,380,2],[379,6,380,6],[382,2,383,2],[382,6,383,6],[370,2,371,2],[370,6,371,6],[372,2,373,2],[372,6,373,6],[374,2,375,2],[374,6,375,6],[351,2,352,2],[351,6,352,6],[353,2,354,2],[353,6,354,6],[355,2,356,2],[355,6,356,6],[345,2,346,2],[345,6,346,6],[347,2,348,2],[347,6,348,6],[349,2,350,2],[349,6,350,6],[339,2,340,2],[339,6,340,6],[341,2,342,2],[341,6,342,6],[343,2,344,2],[343,6,344,6],[328,2,329,2],[328,6,329,6],[330,2,331,2],[330,6,331,6],[332,6,333,6],[337,0,337,2],[337,4,337,6],[322,2,323,2],[322,6,323,6],[324,2,325,2],[324,6,325,6],[326,2,327,2],[326,6,327,6],[314,2,315,2],[314,3,336,3],[314,6,315,6],[315,0,315,1],[316,2,317,2],[316,6,317,6],[318,2,319,2],[318,6,319,6],[320,2,321,2],[320,6,321,6],[305,2,306,2],[305,6,306,6],[308,0,308,6],[311,0,311,1],[312,0,312,2],[312,4,312,6],[298,2,299,2],[298,6,299,6],[300,2,301,2],[300,6,301,6],[302,2,303,2],[302,6,303,6],[292,2,293,2],[292,6,293,6],[294,2,295,2],[294,6,295,6],[296,2,297,2],[296,6,297,6],[286,2,287,2],[286,6,287,6],[288,2,289,2],[288,6,289,6],[290,2,291,2],[290,6,291,6],[280,2,281,2],[280,6,281,6],[282,2,283,2],[282,6,283,6],[284,0,284,2],[284,4,284,6],[257,0,257,6],[260,0,260,1],[261,0,261,2],[261,4,261,6],[263,2,264,2],[263,3,283,3],[263,6,264,6],[264,0,264,1],[265,2,266,2],[265,6,266,6],[273,2,274,2],[273,6,274,6],[275,2,276,2],[275,6,276,6],[277,2,278,2],[277,6,278,6],[267,2,268,2],[267,6,268,6],[269,2,270,2],[269,6,270,6],[271,2,272,2],[271,6,272,6],[246,2,247,2],[246,6,247,6],[248,2,249,2],[248,6,249,6],[251,2,252,2],[251,6,252,6],[240,2,241,2],[240,6,241,6],[242,2,243,2],[242,6,243,6],[244,2,245,2],[244,6,245,6],[234,0,234,2],[234,4,234,6],[236,2,237,2],[236,6,237,6],[238,2,239,2],[238,6,239,6],[224,2,225,2],[224,6,225,6],[227,2,228,2],[227,6,228,6],[231,2,232,2],[231,6,232,6],[216,6,217,6],[218,2,219,2],[218,6,219,6],[220,2,221,2],[220,6,221,6],[222,2,223,2],[222,6,223,6],[209,0,209,1],[210,0,210,2],[210,4,210,6],[212,2,213,2],[212,3,233,3],[212,6,213,6],[213,0,213,1],[214,2,215,2],[214,6,215,6],[216,2,217,2],[197,2,198,2],[197,6,198,6],[199,6,200,6],[202,2,203,2],[202,6,203,6],[206,0,206,6],[191,2,192,2],[191,6,192,6],[193,2,194,2],[193,6,194,6],[195,2,196,2],[195,6,196,6],[185,2,186,2],[185,6,186,6],[187,2,188,2],[187,6,188,6],[189,2,190,2],[189,6,190,6],[178,2,179,2],[178,6,179,6],[180,2,181,2],[180,6,181,6],[183,0,183,2],[183,4,183,6],[155,0,155,6],[158,0,158,1],[159,0,159,2],[159,4,159,6],[161,2,162,2],[161,3,182,3],[161,6,162,6],[162,0,162,1],[163,2,164,2],[163,6,164,6],[171,2,172,2],[171,6,172,6],[173,2,174,2],[173,6,174,6],[175,2,176,2],[175,6,176,6],[165,2,166,2],[165,6,166,6],[167,2,168,2],[167,6,168,6],[169,2,170,2],[169,6,170,6],[145,2,146,2],[145,6,146,6],[148,2,149,2],[148,6,149,6],[152,2,153,2],[152,6,153,6],[138,2,139,2],[138,6,139,6],[140,2,141,2],[140,6,141,6],[142,2,143,2],[142,6,143,6],[132,0,132,2],[132,4,132,6],[134,2,135,2],[134,6,135,6],[136,2,137,2],[136,6,137,6],[124,2,125,2],[124,6,125,6],[126,2,127,2],[126,6,127,6],[129,2,130,2],[129,6,130,6],[116,2,117,2],[116,6,117,6],[119,2,120,2],[119,6,120,6],[122,2,123,2],[122,6,123,6],[108,0,108,2],[108,4,108,6],[110,2,111,2],[110,3,131,3],[110,6,111,6],[111,0,111,1],[112,2,113,2],[112,6,113,6],[114,2,115,2],[114,6,115,6],[98,2,99,2],[98,6,99,6],[101,2,102,2],[101,6,102,6],[104,0,104,6],[107,0,107,1],[92,2,93,2],[92,6,93,6],[94,2,95,2],[94,6,95,6],[96,2,97,2],[96,6,97,6],[86,2,87,2],[86,6,87,6],[88,2,89,2],[88,6,89,6],[90,2,91,2],[90,6,91,6],[80,0,80,2],[80,4,80,6],[82,2,83,2],[82,6,83,6],[84,2,85,2],[84,6,85,6],[58,2,59,2],[58,3,79,3],[58,6,59,6],[59,0,59,1],[60,2,61,2],[60,6,61,6],[62,2,63,2],[62,6,63,6],[64,2,65,2],[64,6,65,6],[72,2,73,2],[72,6,73,6],[74,2,75,2],[74,6,75,6],[77,2,78,2],[77,6,78,6],[66,2,67,2],[66,6,67,6],[68,2,69,2],[68,6,69,6],[70,2,71,2],[70,6,71,6],[48,2,49,2],[48,6,49,6],[52,0,52,6],[55,0,55,1],[56,0,56,2],[56,4,56,6],[41,2,42,2],[41,6,42,6],[43,2,44,2],[43,6,44,6],[45,2,46,2],[45,6,46,6],[35,2,36,2],[35,6,36,6],[37,2,38,2],[37,6,38,6],[39,2,40,2],[39,6,40,6],[29,0,29,2],[29,4,29,6],[31,2,32,2],[31,6,32,6],[33,2,34,2],[33,6,34,6],[0,0,0,6],[5,0,5,1],[6,0,6,2],[6,4,6,6],[8,2,9,2],[8,3,28,3],[8,6,9,6],[10,2,11,2],[10,6,11,6],[12,2,13,2],[20,2,21,2],[20,6,21,6],[22,2,23,2],[22,6,23,6],[25,2,26,2],[25,6,26,6],[12,6,13,6],[14,2,15,2],[14,6,15,6],[16,2,17,2],[16,6,17,6],[18,2,19,2],[18,6,19,6]]}
[{"$f":"TABLAS!$AL$2","v":"FITXES PER A L'ELABORACIÓ D'UNA ESTRATÈGIA LOCAL DE REHABILITACIÓ DE L'ENTORN CONSTRUÏT"}]
[null,null,null,null,null,null,"ETAPA II: ANÀLISI I DIAGNÒSTIC"]
[null,null,null,null,null,null,{"$f":"TABLAS!$AL$4","v":""}]
["II.h  Anàlisi DAFO"]
[]
[{"$f":"IF((COUNTA(A9:A27,E9:E27,A32:A50,E32:E50)>0),\"þ\",\"\")","v":""},null,"EIX 1. TERRITORI, PAISATGE I BIODIVERSITAT"]
["DEBILITATS",null,null,null,"AMENACES"]
[]
[null,null,"D.01 Orografia i estructura morfològica complexa. Elements físics (llits fluvials, infraestructures o altres) que condicionen la connectivitat o el desenvolupament.",null,null,null,"A.01 Planificació territorial escassa o deficient, que en algunes ocasions dificulta la visió estratègica d'un desenvolupament urbà supramunicipal."]
[]
[null,null,"D.02 Desenvolupament territorial dispers d'escassa densitat associat generalment a problemes de mobilitat i de prestació de serveis urbans.",null,null,null,"A.02 Desenvolupament territorial més enfocat a l'expansió que a la regeneració urbana, en ocasions, amb un creixement planificat sobredimensionat."]
[]
[null,null,"D.03 Deteriorament ambiental de determinats entorns que poden comportar una pèrdua de la biodiversitat i/o un deteriorament del paisatge i de la qualitat de vida urbana.",null,null,null,"A.03 Zones en declivi o estancament demogràfic, en un fenomen d'abast territorial de pèrdua de població i habitatges, i una elevada taxa d'envelliment."]
[]
[null,null,"D.04 Falta de connexió entre l'entorn urbà i el rural, que pot implicar un fenomen de congestió de les àrees urbanes i/o despoblament i abandó rural.",null,null,null,"A.04 Dèficit de mesures de protecció i conservació del patrimoni natural, cultural i paisatgístic, per a fer front a la seua degradació i combatre el vandalisme."]
[]
[null,null,"D.05 Antagonisme entre la perspectiva de la planificació urbana i la rural;\nla urbana té com a eix el desenvolupament, la rural protegir i conservar.",null,null,null,"A.05 Falta de flexibilitat en els instruments de planificació, per a adoptar mesures com la creació de corredors ecològics i combatre la pèrdua de la biodiversitat."]
[]
[null,null,"D.06 Absència de mesures explícites per a compensar els xicotets municipis davant del creixement dels municipis més grans.",null,null,null,"A.06 Turisme insostenible, gran consumidor de recursos."]
[]
[null,null,"D.07 Necessitat d'abordar el fenomen del despoblament des de l'estudi del territori i els instruments de planificació d'àmbit supralocal o comarcal.",null,null,null,"A.07 Planificació rural massa bucòlica, basada en la protecció del medi rural, que no contempla altres actius."]
[]
[null,null,"D.08 Models de planificació rígids, que demanden escales diferents i objectius diferents per als nous problemes."]
[]
[]
[]
[]
[null,null," "]
[]
["FORTALESES",null,null,null,"OPORTUNITATS"]
[]
[null,null,"F.01 Experiència en iniciatives de desenvolupament sostenible i utilització d'instruments de planificació (plans urbanístics, territorials, de sostenibilitat, de mobilitat urbana sostenible, de qualitat de l'aire, etc.).",null,null,null,"O.01 Connexió de la ciutat amb l'entorn rural millorant la qualitat ambiental de la ciutat, mitjançant la recuperació d'espais degradats i la seua conversió en zones verdes en connexió amb els actius naturals del municipi."]
[]
[null,null,"F.02 Riquesa del patrimoni natural i mediambiental, l'ús i la gestió de la qual és clau en la generació de processos sostenibles.",null,null,null,"O.02 Patrimoni natural infrautilitzat, que pot constituir la base sobre la qual desenvolupar actuacions i estratègies de desenvolupament urbà sostenible."]
[]
[null,null,"F.03 Riquesa agrícola, ramadera i forestal de l'entorn, que contribueix al desenvolupament econòmic de la ciutat i ofereix un element de vinculació entre l'element urbà i el rural.",null,null,null,"O.03 Atractiu d'abast territorial dels béns culturals, com a elements clau en el desenvolupament urbà i de competitivitat de les ciutats."]
[]
[null,null,"F.04 Creixent interés i valoració social i del sector empresarial, del patrimoni natural i paisatgístic, favorable a un desenvolupament més sostenible.",null,null,null,"O.04 Presència de grans infraestructures i instal·lacions, que poden aportar avantatges competitius, com la proximitat a aeroports, ports comercials o complexos industrials."]
[]
[null,null,"F.05 Ciutats ben comunicades, això afavoreix el desenvolupament d'àrees dinàmiques d'activitat i la qualitat de vida dels ciutadans.",null,null,null,"O.05 Àmplia xarxa de camins naturals i rurals, com a potencial de millora de l'entorn rural i del medi ambient, i la seua vinculació amb el medi urbà."]
[]
[null,null,"F.06 Riquesa del paisatge i de la biodiversitat amb una gran capacitat de servir de base per a la millora de la qualitat de vida urbana.",null,null,null,"O.06 Patrimoni natural i paisatgístic infrautilitzat, amb gran potencial per a desenvolupar actuacions de dotació de serveis i infraestructures."]
[]
[null,null,"F.07 Consideració del sector primari com un possible actiu econòmic.",null,null,null,"O.07 Medi natural, paisatge i patrimoni com a base per a un turisme sostenible respectuós amb el medi ambient, no consumidor de recursos."]
[]
[null,null,null,null,null,null,"O.08 Existència d'un Pla nacional contra el despoblament: document elaborat per la Comissió de Despoblament de la FEMP"]
[]
[]
[]
[]
[]
[]
[{"$f":"TABLAS!$AL$2","v":"FITXES PER A L'ELABORACIÓ D'UNA ESTRATÈGIA LOCAL DE REHABILITACIÓ DE L'ENTORN CONSTRUÏT"}]
[null,null,null,null,null,null,{"$f":"IF($G$2=\"\",\"\",$G$2)","v":"ETAPA II: ANÀLISI I DIAGNÒSTIC"}]
[null,null,null,null,null,null,{"$f":"TABLAS!$AL$4","v":""}]
[{"$f":"IF((COUNTA(A59:A77,E59:E77,A83:A101,E83:E101)>0),\"þ\",\"\")","v":""},null,"EIX 2. MODEL DE CIUTAT"]
["DEBILITATS",null,null,null,"AMENACES"]
[]
[null,null,"D.01 Dèficit o inadequació de l'espai públic, zones verdes i espais lliures, amb els efectes negatius consegüents sobre la salut i la qualitat de vida.",null,null,null,"A.01 Centre urbà degradat i/o en procés d'abandó, a conseqüència d'unes dinàmiques supramunicipals de desplaçament de les llars a zones periurbanes."]
[]
[null,null,"D.02 Dèficit d'infraestructures i serveis urbans, per inexistència o per falta d'adequació a les noves realitats i demandes de la població.",null,null,null,"A.02 Dèficit d'infraestructures i serveis urbans. Pot tractar-se de la inexistència d'aquestes o de l'adaptació a les noves realitats i demandes de la població."]
[]
[null,null,"D.03 Problemes d'accessibilitat i barreres arquitectòniques, especialment, en els espais públics urbanitzats.",null,null,null,"A.03 Forta estacionalitat turística que pot produir un desajustament en l'ús de l'espai públic i les dotacions de serveis i infraestructures urbanes."]
[]
[null,null,"D.04 Centre urbà degradat i/o en procés d'abandó, amb freqüència, derivat d'un desplaçament de les llars joves a barris perifèrics de la ciutat.",null,null,null,"A.04 Disminució de la grandària mitjana de la llar, un fenomen demogràfic global que té importants implicacions en el model de ciutat i l'adequació del parc d'habitatge."]
[]
[null,null,"D.05 Parc edificatori deficient. Elevada taxa d'edificis d'habitatges i destinats a altres usos ineficients energèticament i amb problemes d'accessibilitat.",null,null,null,"A.05 Falta de flexibilitat en els instruments de planificació, per a adoptar mesures com la creació de corredors ecològics i combatre la pèrdua de la biodiversitat."]
[]
[null,null,"D.06 Contaminació acústica i lumínica en determinades zones, amb els problemes que això implica en el medi ambient, la qualitat de vida i la salut.",null,null,null,"A.06 Prioritat de la inversió privada en els centres urbans respecte a la pública, la qual cosa pot donar lloc a processos de gentrificació."]
[]
[null,null,"D.07 Contaminació de determinats àmbits de sòl. Determinats espais urbans que presenten elevats índexs de contaminació, sobre els quals cal actuar."]
[]
[null,null,"D.08 Complexitat d'ordenació i configuració pel traçat històric en els barris."]
[]
[null,null,"D.09 Model de desenvolupament urbà de les últimes dècades sectorial i monofuncional, amb els consegüents problemes de mobilitat, proximitat, despesa energètica i sostenibilitat."]
[]
[]
[]
[]
[]
["FORTALESES",null,null,null,"OPORTUNITATS"]
[]
[null,null,"F.01 Riquesa del patrimoni urbà i arquitectònic amb un alt valor històric, artístic i cultural, que constitueixen actius de gran potencialitat i senyal d'identitat local.",null,null,null,"O.01 Programes d'ajudes i fons autonòmics, nacionals i europeus per a promoure un desenvolupament urbà equilibrat, sostenible i integrat."]
[]
[null,null,"F.02 Ciutat compacta, especialment, en els centres urbans, amb una trama urbana que facilita la trobada ciutadana, la mobilitat sostenible i l'activitat.",null,null,null,"O.02 Polítiques autonòmiques i nacionals en relació a la rehabilitació, regeneració i renovació urbana que fomenten un model de ciutat més sostenible."]
[]
[null,null,"F.03 Ciutats ben comunicades, que permeten el desenvolupament d'importants enclavaments d'activitat logística per al desenvolupament econòmic i de determinades indústries.",null,null,null,"O.03 Integració de les zones turístiques i costaneres amb les infraestructures de comunicació de les ciutats."]
[]
[null,null,"F.04 Multiculturalitat i diversitat dels barris, com a factor enriquidor que pot servir de base per a constituir una comunitat urbana integrada.",null,null,null,"O.04 Potencialitat de les grans ciutats com a punt d'atracció per a ciutats pròximes (xarxa policèntrica)."]
[]
[null,null,"F.05 Notable avanç en la millora de l'espai públic, principalment en relació amb l'accessibilitat, la mobilitat sostenible i la conversió en zona de vianants.",null,null,null,"O.05 Connexió de la ciutat amb l'entorn rural millorant l'equilibri entre l'àrea urbana i rural per a evitar la cogestió a les ciutats i el despoblament de les zones rurals."]
[]
[null,null,"F.06 Revisió dels instruments d'ordenació urbanística per a un desenvolupament més sostenible i equilibrat, a vegades, desclassificant sòl innecessari.",null,null,null,"O.06 Programes i fonts de finançament per a la conservació del patrimoni arquitectònic."]
[]
[null,null,"F.07 Acceptació generalitzada de la importància de la participació de societat civil, administracions i sector privat en la producció de ciutat sostenible.",null,null,null,"O.07 Difusió i potenciació de la cultura, esport, gastronomia, patrimoni, festes tradicionals dels pobles i ciutats d'Espanya."]
[]
[null,null,"F.08 Consciència social sobre la necessitat de pensar en un model de ciutat més sostenible.",null,null,null,"O.08 Nous usos vinculats al turisme que afavorisquen la conservació del patrimoni arquitectònic, donada la rellevància turística de nombroses ciutats espanyoles."]
[]
[null,null,null,null,null,null,"O.09 Metodologia de diagnòstic i pla d'acció de la Destinació turística intel·ligent al servei d'una ciutat més sostenible."]
[]
[]
[]
[]
[]
[{"$f":"TABLAS!$AL$2","v":"FITXES PER A L'ELABORACIÓ D'UNA ESTRATÈGIA LOCAL DE REHABILITACIÓ DE L'ENTORN CONSTRUÏT"}]
[null,null,null,null,null,null,{"$f":"IF($G$2=\"\",\"\",$G$2)","v":"ETAPA II: ANÀLISI I DIAGNÒSTIC"}]
[null,null,null,null,null,null,{"$f":"TABLAS!$AL$4","v":""}]
[{"$f":"IF((COUNTA(A111:A129,E111:E129,A135:A152,E135:E152)>0),\"þ\",\"\")","v":""},null,"EIX 3. CANVI CLIMÀTIC I RESILIÈNCIA"]
["DEBILITATS",null,null,null,"AMENACES"]
[]
[null,null,"D.01 Alt consum energètic fòssil, principalment en edificis i en transport, això té importants repercussions en el medi ambient i la qualitat de vida.",null,null,null,"A.01 Contaminació atmosfèrica/mediambiental. Elevats nivells d'emissió de gasos d'efecte d'hivernacle i de contaminació d'abast territorial."]
[]
[null,null,"D.02 Contaminació derivada de la indústria i l'activitat. Amb freqüència, l'activitat econòmica i determinades indústries produeixen agents contaminants.",null,null,null,"A.02 Riscos naturals i efectes del canvi climàtic. Exposició als riscos naturals i problemes vinculats al canvi climàtic, com ara inundacions, onades de calor o sequeres."]
[]
[null,null,"D.03 Urbanisme poc resilient al canvi climàtic.",null,null,null,"A.03 Problemes de salut i qualitat de vida vinculats a l'efecte del canvi climàtic o la contaminació atmosfèrica i dels riscos i efectes de l'activitat industrial."]
[]
[null,null,"D.04 Estudis i mesures d'adaptació al canvi climàtic insuficients."]
[]
[]
[]
[]
[]
[]
[]
[]
[]
[]
[]
[]
[]
[]
[]
["FORTALESES",null,null,null,"OPORTUNITATS"]
[]
[null,null,"F.01 Polítiques públiques en matèria de mitigació del canvi climàtic i de foment d'energies sostenibles.",null,null,null,"O.01 Polítiques nacionals i europees relacionades amb l'adaptació-mitigació al canvi climàtic; translació a la realitat local."]
[]
[null,null,"F.02 Condicions climàtiques que afavoreixen la qualitat de vida dels ciutadans i redueixen el consum energètic.",null,null,null,"O.02 Connexió de la ciutat amb l'entorn rural millorant la qualitat ambiental de la ciutat, mitjançant la recuperació d'espais degradats i la conversió en zones verdes en connexió amb els actius naturals del municipi."]
[]
[null,null,"F.03 Mesures per al control del soroll i emissions contaminants, mitjançant una avaluació de la situació que permet adoptar les mesures correctores pertinents.",null,null,null,"O.03 Xarxes de ciutats, programes d'adhesió a pactes o estratègies per a la millora d'eficiència energètica, energies renovables i contra el canvi climàtic."]
[]
[null,null,"F.04 Potencial en economia baixa en carboni, energies netes i lluita contra el canvi climàtic de determinades iniciatives ambientals ciutadanes.",null,null,null,"O.04 Increment de la sensibilització ciutadana en matèria mediambiental i davant del repte del canvi climàtic i els seus efectes en els entorns urbans."]
[]
[null,null,"F.05 Implantació de mesures per a la lluita contra incendis forestals o inundacions, com ara plans de gestió i millora forestal o agències per a l'estudi d'inundacions."]
[]
[]
[]
[]
[]
[]
[]
[]
[]
[]
[]
[]
[{"$f":"TABLAS!$AL$2","v":"FITXES PER A L'ELABORACIÓ D'UNA ESTRATÈGIA LOCAL DE REHABILITACIÓ DE L'ENTORN CONSTRUÏT"}]
[null,null,null,null,null,null,{"$f":"IF($G$2=\"\",\"\",$G$2)","v":"ETAPA II: ANÀLISI I DIAGNÒSTIC"}]
[null,null,null,null,null,null,{"$f":"TABLAS!$AL$4","v":""}]
[{"$f":"IF((COUNTA(A162:A180,E162:E180,A186:A204,E186:E204)>0),\"þ\",\"\")","v":""},null,"EIX 4. GESTIÓ SOSTENIBLE DELS RECURSOS I ECONOMIA CIRCULAR"]
["DEBILITATS",null,null,null,"AMENACES"]
[]
[null,null,"D.01 Infraestructures locals poc eficients, sobre les quals és necessari escometre actuacions per a millorar l'eficiència energètica i incorporar les energies renovables.",null,null,null,"A.01 Alta dependència energètica exterior en un context d'escassa producció d'energies renovables en l'àmbit municipal i baix nivell d'autosuficiència."]
[]
[null,null,"D.02 Sistema de gestió de residus inadequat, amb difícil accés al nucli urbà o amb instal·lacions deficients o obsoletes en el context del reciclatge i de l'economia circular.",null,null,null,"A.02 Augment de la pressió sobre la salut humana, el medi ambient i sobre els recursos naturals o un dèficit ecològic per una excessiva generació de residus i un elevat consum de recursos."]
[]
[null,null,"D.03 Deficient gestió i infraestructures hídriques. Problemes vinculats a una inadequada gestió de les xarxes de proveïment d'aigua o recursos hídrics.",null,null,null,"A.03 Elevada pressió turística que a vegades genera un gran impacte sobre determinades zones, especialment en el cas del litoral o altres entorns sensibles ambientalment."]
[]
[null,null,"D.04 Activitats productives de baixa eficiència energètica, amb un elevat consum d'energia final.",null,null,null,"A.04 Efectes d'explotacions agrícoles intensives en determinats entorns en els quals hi ha un elevat desenvolupament d'aquesta activitat."]
[]
[null,null,"D.05 Sistemes de depuració d'aigües residuals d'alt cost d'explotació.",null,null,null,"A.05 Problemes de gestió hídrica d'abast supramunicipal o regional que poden afectar els entorns urbans."]
[]
[null,null,"D.06 Escassa cultura pública i privada sobre l'ús compartit de béns o l'adquisició de béns reutilitzats, reciclats o refabricats.",null,null,null,"A.06 Aspectes de la normativa supramunicipal que impliquen determinades barreres per al desenvolupament i la implantació de les energies renovables."]
[]
[null,null,"D.07 Metabolisme urbà: escàs desenvolupament de plantejaments holístics.",null,null,null,"A.07 Escassetat de matèries primeres essencials i augment dels preus per al desenvolupament de l'economia global i local."]
[]
[null,null,null,null,null,null,"A.08 Augment de població en situació de “pobresa energètica”."]
[]
[]
[]
[]
[]
[]
[]
["FORTALESES",null,null,null,"OPORTUNITATS"]
[]
[null,null,"F.01 Riquesa del patrimoni natural i mediambiental, l'ús i la gestió de la qual és clau en la generació de processos sostenibles.",null,null,null,"O.01 Polítiques nacionals i europees relacionades amb la promoció de les energies renovables i l'eficiència energètica."]
[]
[null,null,"F.02 Polítiques municipals en matèria d'eficiència energètica, com la millora de l'enllumenat públic o la incorporació d'energies renovables en edificis i instal·lacions municipals.",null,null,null,"O.02 Patrimoni natural infrautilitzat, que pot constituir la base sobre la qual desenvolupar actuacions i estratègies de desenvolupament urbà sostenible."]
[]
[null,null,"F.03 Bona qualitat de l'aigua i/o de l'aire, en termes generals, amb efectes positius sobre la salut humana.",null,null,null,"O.03 El desenvolupament de l'activitat de gestió de residus com a àmbit clau en la millora i conservació del medi ambient i la generació d'ocupació a les ciutats."]
[]
[null,null,"F.04 Mesures per al control del soroll i emissions contaminants, mitjançant una avaluació de la situació que permet adoptar les mesures correctores pertinents.",null,null,null,"O.04 Xarxes de ciutats, programes d'adhesió a pactes o estratègies per a la millora d'eficiència energètica, energies renovables i contra el canvi climàtic."]
[]
[null,null,"F.05 Implantació de mesures per a la lluita contra incendis forestals o inundacions, com ara plans de gestió i millora forestal o agències per a l'estudi d'inundacions.",null,null,null,"O.05 Desenvolupament tecnològic vinculat a la generació energètica mitjançant fonts renovables en els entorns urbans, a l'estalvi i eficiència en l'enllumenat públic…"]
[]
[null,null,"F.06 Capacitat tècnica i tecnològica per a la implantació d'energies renovables.",null,null,null,"O.06 Elevat potencial de desenvolupament d'energies renovables, especialment la fotovoltaica."]
[]
[null,null,null,null,null,null,"O.07 Necessitat de matèria orgànica per a mantindre la capacitat productiva del sòl i la superfície verda de les ciutats."]
[]
[null,null,null,null,null,null,"O.08 Aposta per un creixement sostenible sota els principis de l'economia circular, aprofitant el creixement econòmic."]
[]
[]
[]
[]
[]
[]
[{"$f":"TABLAS!$AL$2","v":"FITXES PER A L'ELABORACIÓ D'UNA ESTRATÈGIA LOCAL DE REHABILITACIÓ DE L'ENTORN CONSTRUÏT"}]
[null,null,null,null,null,null,{"$f":"IF($G$2=\"\",\"\",$G$2)","v":"ETAPA II: ANÀLISI I DIAGNÒSTIC"}]
[null,null,null,null,null,null,{"$f":"TABLAS!$AL$4","v":""}]
[{"$f":"IF((COUNTA(A213:A231,E213:E231,A237:A255,E237:E255)>0),\"þ\",\"\")","v":""},null,"EIX 5. MOBILITAT I TRANSPORT"]
["DEBILITATS",null,null,null,"AMENACES"]
[]
[null,null,"D.01 Patrons de mobilitat poc sostenible, amb un predomini del desplaçament en vehicle privat, respecte a la mobilitat per als vianants o ciclista.",null,null,null,"A.01 Efectes de mobilitat vinculats a un desenvolupament territorial dispers d'escassa densitat, per noves expansions urbanes o urbanitzacions aïllades."]
[]
[null,null,"D.02 Problemes de trànsit i mobilitat, de circulació i congestió a les ciutats i àrees urbanes a causa del trànsit diari dels desplaçaments casa - treball.",null,null,null,"A.02 Problemes de trànsit i mobilitat, de circulació i congestió en els accessos a les ciutats i àrees urbanes per desplaçaments vinculats al turisme i a l'oci."]
[]
[null,null,"D.03 Dèficit de transport públic, manca i deficiències en determinades zones i falta d'intercanviadors o infraestructures que faciliten la intermodalitat.",null,null,null,"A.03 Millora de la xarxa de carreteres en l'àmbit territorial que pot incentivar l'ús del vehicle privat en detriment del transport públic."]
[]
[null,null,"D.04 Dèficit d'aparcaments dissuasius en l'accés a les grans ciutats.",null,null,null,"A.04 Increment dels nivells de contaminació atmosfèrica com a efecte de l'ús del vehicle privat en l'entorn urbà i espais periurbans."]
[]
[null,null,"D.05 Dèficit d'infraestructures de mobilitat sostenible, de xarxa de carril bici o d'infraestructures per al desplegament de la mobilitat alternativa.",null,null,null,"A.05 Problemes de mobilitat conseqüència d'alts fluxos de moviment en determinades zones i períodes que poden veure's afectats per l'increment d'afluència del turisme."]
[]
[null,null,"D.06 Absència d'una estratègia de mobilitat integrada i lligada a l'accessibilitat i a plans de mobilitat urbana sostenible, consistents amb cada realitat urbana."]
[]
[null,null,"D.07 Els processos de dispersió demogràfica i activitats en les àrees metropolitanes estan creant problemes de connectivitat i disfuncionalitat en l'ús de les xarxes de transport."]
[]
[]
[]
[]
[]
[]
[]
[]
[]
["FORTALESES",null,null,null,"OPORTUNITATS"]
[]
[null,null,"F.01 Iniciatives municipals i treballs desenvolupats per a l'elaboració i aprovació de plans de mobilitat urbana sostenible (PMUS).",null,null,null,"O.01 Programes i fons autonòmics, nacionals i europeus, que faciliten i promouen les infraestructures de mobilitat urbana sostenible."]
[]
[null,null,"F.02 Projectes i iniciatives municipals per al foment del transport públic sostenible i no contaminant.",null,null,null,"O.02 Presència de grans infraestructures de transport, que milloren l'accessibilitat territorial i la mobilitat com ara aeroports o ports comercials."]
[]
[null,null,"F.03 Ciutats ben comunicades, amb caràcter general, dotades d'una bona xarxa d'infraestructures de comunicació, millorada en els últims anys.",null,null,null,"O.03 Potencialitat de les xarxes policèntriques de ciutats com a suport per a plantejar una estratègia territorial de mobilitat sostenible."]
[]
[null,null,"F.04 Model de ciutat compacta, especialment en els centres urbans, la qual cosa facilita la proximitat i la mobilitat sostenible.",null,null,null,"O.04 Plans supramunicipals de transport sostenible, que milloren la connexió interurbana amb transport públic sostenible i amb mitjans de transport bla."]
[]
[null,null,"F.05 Condicions favorables de clima i topografia per a l'impuls dels mitjans de transport blans: per als vianants i bicicleta.",null,null,null,"O.05 Introducció de les TIC en la gestió dels serveis urbans de transport, com a element clau de millora de la seua qualitat i sostenibilitat."]
[]
[null,null,"F.06 Nombroses actuacions relacionades amb la mobilitat sostenible: principalment conversió en zona de vianants i carrils bici.",null,null,null,"O.06 Possibilitat de creació d'aparcaments dissuasius."]
[]
[null,null,null,null,null,null,"O.07 Conscienciar i educar la societat sobre la mobilitat i el transport sostenibles."]
[]
[]
[]
[]
[]
[]
[]
[]
[{"$f":"TABLAS!$AL$2","v":"FITXES PER A L'ELABORACIÓ D'UNA ESTRATÈGIA LOCAL DE REHABILITACIÓ DE L'ENTORN CONSTRUÏT"}]
[null,null,null,null,null,null,{"$f":"IF($G$2=\"\",\"\",$G$2)","v":"ETAPA II: ANÀLISI I DIAGNÒSTIC"}]
[null,null,null,null,null,null,{"$f":"TABLAS!$AL$4","v":""}]
[{"$f":"IF((COUNTA(A264:A282,E264:E282,A287:A305,E287:E305)>0),\"þ\",\"\")","v":""},null,"EIX 6. COHESIÓ SOCIAL I IGUALTAT D'OPORTUNITATS"]
["DEBILITATS",null,null,null,"AMENACES"]
[]
[null,null,"D.01 Elevada taxa d'envelliment, a conseqüència de la caiguda de la natalitat, de l'emigració de la població jove, o la immigració de persones estrangeres d'avançada edat.",null,null,null,"A.01 Desigualtat econòmica i social de l'entorn i elevada pobresa relativa, en el marc d'unes dinàmiques territorials que afecten la ciutat en el seu conjunt."]
[]
[null,null,"D.02 Elevada taxa de desocupació, associada a l'augment de la població en risc d'exclusió social i a l'increment del nombre de demandants de serveis socials.",null,null,null,"A.02 Prestacions socials insuficients o no adaptades a les noves realitats i demandes de la població, especialment per als col·lectius més desfavorits."]
[]
[null,null,"D.03 Barris sumits en processos de degradació i/o abandó, la qual cosa agreuja els problemes socials dels residents.",null,null,null,"A.03 Augment del pes de la denominada quarta edat, que comportarà un augment significatiu de les demandes socials en un context d'important bretxa digital."]
[]
[null,null,"D.04 Concentració de la vulnerabilitat urbana i exclusió social en determinats entorns, caracteritzats per un major percentatge de pobresa urbana i de desocupació.",null,null,null,"A.04 Desigualtat i bretxa de gènere, fenòmens que afecten de manera més intensa determinats col·lectius o accentuen les diferències entre homes i dones."]
[]
[null,null,"D.05 Conseqüències socials de la deterioració del medi ambient urbà en algunes zones, que condueixen a una pèrdua de la qualitat de vida i de les oportunitats dels seus habitants.",null,null,null,"A.05 Fort estacionalitat turística en determinades zones, amb serioses implicacions en la prestació de serveis o en el mercat de treball local."]
[]
[null,null,"D.06 Àmbits d'infrahabitatge o assentaments irregulars, en alguns barris en els quals s'identifiquen problemes de barraquisme o conjunts d'infrahabitatges.",null,null,null,"A.06 Bretxa entre la formació de la població i els perfils demandats en el mercat de treball, que requereix actuacions en matèria d'educació i formació."]
[]
[null,null,"D.07 Problemes d'absentisme i abandó escolar en determinats barris, que produeixen una deterioració de les oportunitats sociolaborals dels seus habitants.",null,null,null,"A.07 Efectes de determinades explotacions agrícoles intensives en el perfil socioeconòmic de la població, amb important presència d'estrangers o minories ètniques."]
[]
[null,null,"D.08 Baix nivell educatiu i formatiu de la població, a vegades, a conseqüència d'una activitat econòmica molt especialitzada en el sector primari o industrial.",null,null,null,"A.08 Envelliment i degradació de barris construïts en els anys 1950-1980, tant des del punt de vista demogràfic i social, com físic (construccions i infraestructures)."]
[]
[]
[]
[]
[]
[]
["FORTALESES",null,null,null,"OPORTUNITATS"]
[]
[null,null,"F.01 Existència d'iniciatives locals, plans per a fomentar la cooperació, millorar la convivència, la cohesió social, evitar l'absentisme escolar i afavorir la inclusió sociolaboral.",null,null,null,"O.01 Desenvolupament de programes en l'àmbit social, amb finançament europeu, com a oportunitat per a millorar les condicions socioeconòmiques de la població urbana."]
[]
[null,null,"F.02 Experiència en programes d'inclusió social amb finançament europeu, d'acord amb la programació dels diferents períodes de fons de la UE.",null,null,null,"O.02 Iniciatives i programes orientats a atraure població jove, tant resident com flotant, en matèria d'habitatge, equipaments i serveis adaptats."]
[]
[null,null,"F.03 Model de ciutat compacta, trama urbana que facilita la convivència i la solidaritat veïnal, així com el desenvolupament i la viabilitat dels serveis locals.",null,null,null,"O.03 Ús de les TIC per a la millora de la governança i la participació ciutadana, per a millorar el sentiment de pertinença, el compromís i la cooperació ciutadana."]
[]
[null,null,"F.04 Bon nivell de convivència i seguretat ciutadana, que caracteritza, en general les ciutats espanyoles, dos aspectes que es troben estretament vinculats.",null,null,null,"O.04 Barris amb forta identitat urbana i arrelament social, com a factor d'atracció per a mantindre o recuperar població, que responga a les tradicions i la cultura local."]
[]
[null,null,"F.05 Xarxa de serveis d'alta qualitat i prestacions, amb les quals compta la major part de les ciutats en matèria d'educació, sanitaris, esportius o per a persones majors.",null,null,null,"O.05 Multiculturalitat i diversitat dels barris com a factor enriquidor, que permet el desenvolupament d'iniciatives vinculades al respecte i la integració social."]
[]
[null,null,"F.06 Població activa altament qualificada, amb la qual compta amb freqüència les grans ciutats, i constitueix una base per al desenvolupament econòmic i factor de competitivitat.",null,null,null,"O.06 Iniciatives orientades a fomentar l'ús de les TIC per al desenvolupament d'accions en matèria d'administració electrònica i prestació de serveis."]
[]
[null,null,"F.07 Existència de programes específics per a l'atracció de joves i la seua permanència a la ciutat, desenvolupats a vegades a escala local.",null,null,null,"O.07 Situació estratègica de centre de referència social i assistencial per a les localitats pròximes, que genera un increment de l'activitat urbana."]
[]
[null,null,"F.08 Important teixit associatiu, amb una ciutadania compromesa amb el desenvolupament social i econòmic i la presència d'un gran nombre d'associacions.",null,null,null,"O.08 Existència d'espais públics i solars buits que poden ser utilitzats per a activitats vinculades amb el desenvolupament social i econòmic del barri."]
[]
[null,null,null,null,null,null,"O.09 Desenvolupament turístic de zones despoblades per a donar suport a la fixació de població al territori i la seua dinamització econòmica."]
[]
[]
[]
[]
[]
[{"$f":"TABLAS!$AL$2","v":"FITXES PER A L'ELABORACIÓ D'UNA ESTRATÈGIA LOCAL DE REHABILITACIÓ DE L'ENTORN CONSTRUÏT"}]
[null,null,null,null,null,null,{"$f":"IF($G$2=\"\",\"\",$G$2)","v":"ETAPA II: ANÀLISI I DIAGNÒSTIC"}]
[null,null,null,null,null,null,{"$f":"TABLAS!$AL$4","v":""}]
[{"$f":"IF((COUNTA(A315:A335,E315:E335,A340:A358,E340:E358)>0),\"þ\",\"\")","v":""},null,"EIX 7. ECONOMIA URBANA"]
["DEBILITATS",null,null,null,"AMENACES"]
[]
[null,null,"D.01 Incapacitat de la ciutat per a atraure i retindre talent, motivada per la falta de teixit empresarial i la bretxa entre formació i mercat de treball.",null,null,null,"A.01 Elevada taxa de desocupació, àmbit territorial caracteritzat per un major impacte de la crisi econòmica, en termes d'ocupació i activitat."]
[]
[null,null,"D.02 Efectes d'una activitat econòmica molt especialitzada en un únic sector d'activitat, com, per exemple, la construcció i indústries associades o el turisme i els serveis.",null,null,null,"A.02 Sectors productius predominants, més afectats per la crisi econòmica, per tindre una important especialització en sectors com la construcció."]
[]
[null,null,"D.03 Escassa innovació i valor afegit en l'economia local, amb una escassa presència d'empreses i treballadors en àmbits d'activitat densos en coneixement.",null,null,null,"A.03 Dinàmiques territorials d'abandó de determinats entorns, a conseqüència d'una elevada taxa de desocupació, especialment en la població jove."]
[]
[null,null,"D.04 Falta de recursos públics i privats per al desenvolupament d'actuacions d'impuls i foment de l'activitat econòmica local i de programes d'ajudes i estímuls.",null,null,null,"A.04 Tendència al decreixement econòmic i poblacional motivat per l'impuls o la major activitat i atractiu d'una àrea urbana o metropolitana pròxima."]
[]
[null,null,"D.05 Alt nivell de desocupació i ocupació precaritzada en algunes ciutats, amb elevada taxa d'atur de llarga duració, inestabilitat laboral o reduïts nivells retributius.",null,null,null,"A.05 Destrucció del teixit empresarial local, davant de la proximitat de grans centres comercials, amb especial impacte en petites i mitjanes empreses."]
[]
[null,null,"D.06 Falta de vocació empresarial entre els joves i de la població de la ciutat, en un context d'insuficients oportunitats i mitjans per a l'emprenedoria.",null,null,null,"A.06 Obsolescència o abandó de grans àrees industrials, a causa de factors com la pèrdua de competitivitat, processos de reconversió o altres circumstàncies."]
[]
[null,null,"D.07 Insuficient oferta o oportunitats de primera ocupació per a joves en l'àrea urbana, amb escasses alternatives de formació per a l'ocupació en el teixit empresarial.",null,null,null,"A.07 Insuficiència de mesures de suport a l'emprenedoria i a la implantació empresarial, mitjançant estímuls com les ajudes econòmiques o avantatges en el finançament."]
[]
[null,null,"D.08 Escassa inversió privada productiva, en un context de prevalença de l'activitat del sector públic i un teixit empresarial privat feble.",null,null,null,"A.08 Vulnerabilitat del sector agrícola de l'entorn, per estar en situació de declivi o pendent de processos estratègics de reposicionament en el mercat."]
[]
[null,null,null,null,null,null,"A.09 Pèrdua de poder adquisitiu de la població, a conseqüència de pèrdua d'ocupació o la precarietat laboral.\n"]
[]
[null,null,null,null,null,null,"A.10 Escassa cultura exportadora, en un context de globalització i d'insuficient coordinació entre el sector públic i el teixit empresarial."]
[]
[]
[]
[]
["FORTALESES",null,null,null,"OPORTUNITATS"]
[]
[null,null,"F.01 Actius culturals, patrimonials i paisatgístics, com a elements clau per a fomentar i/o enriquir l'activitat turística, l'economia i l'ocupació.",null,null,null,"O.01 Inversions públiques i privades i programes finançats pels fons europeus orientats a generar activitat econòmica innovadora i emprenedora."]
[]
[null,null,"F.02 Gran capacitat econòmica i de creació d'ocupació en els serveis, turisme i indústria, sectors de gran presència en les grans ciutats.",null,null,null,"O.02 Polítiques autonòmiques i nacionals en relació a la rehabilitació, regeneració i renovació urbana com a motor d'ocupació, i reactivador de la construcció."]
[]
[null,null,"F.03 Programes locals d'ocupació i de foment d'activitats econòmiques, orientats a determinats col·lectius (p. e. Municipis per l'Economia del Bé Comú).",null,null,null,"O.03 Potencialitat de les xarxes policèntriques de ciutats com a punt d'atracció per a fomentar i/o implantar activitats econòmiques."]
[]
[null,null,"F.04 Existència d'una àmplia oferta hotelera i de restauració, que millora l'atractiu i afavoreix l'activitat turística i l'ocupació a la ciutat.",null,null,null,"O.04 Programes de foment de l'expansió d'empreses i la promoció exterior de productes locals, en un context de globalització."]
[]
[null,null,"F.05 Reconeixement nacional i internacional de les ciutats espanyoles, una marca ciutat que es vincula a un conjunt valors positius en la percepció de la seua qualitat.",null,null,null,"O.05 Estratègies de potenciació de la indústria agroalimentària i del sector logístic, per a diversificar i fomentar l'activitat econòmica amb els recursos de l'entorn rural."]
[]
[null,null,"F.06 Capacitat d'atracció d'inversió i capital, que pot implicar una millora en l'oferta d'ocupació per als ciutadans.",null,null,null,"O.06 Programes de foment de l'emprenedoria, especialment dirigit als joves o a col·lectius caracteritzats per un major dèficit en formació per a l'ocupació."]
[]
[null,null,"F.07 Capacitat de creació d'ocupació en sectors altament especialitzats com, per exemple, l'aeronàutica, la construcció naval o la indústria farmacèutica.",null,null,null,"O.07 Potencial turístic sense explotar, vinculat a determinats actius o recursos que requereixen dactuacions de rehabilitació, reforma i posada en valor."]
[]
[null,null,"F.08 Fort dinamisme empresarial en algunes àrees urbanes, que incideix en un increment en el nombre d'empreses, capacitat emprenedora i associacionisme empresarial.",null,null,null,"O.08 Accions d'impuls de l'activitat econòmica mitjançant la integració i el desenvolupament de grans infraestructures, com ara ports comercials o aeroports."]
[]
[null,null,null,null,null,null,"O.09 Polítiques de desconcentració i desestacionalització del turisme."]
[]
[]
[]
[]
[{"$f":"TABLAS!$AL$2","v":"FITXES PER A L'ELABORACIÓ D'UNA ESTRATÈGIA LOCAL DE REHABILITACIÓ DE L'ENTORN CONSTRUÏT"}]
[null,null,null,null,null,null,{"$f":"IF($G$2=\"\",\"\",$G$2)","v":"ETAPA II: ANÀLISI I DIAGNÒSTIC"}]
[null,null,null,null,null,null,{"$f":"TABLAS!$AL$4","v":""}]
[{"$f":"IF((COUNTA(A367:A385,E367:E385,A391:A408,E391:E408)>0),\"þ\",\"\")","v":""},null,"EIX 8. HABITATGE"]
["DEBILITATS",null,null,null,"AMENACES"]
[]
[null,null,"D.01 Dificultats d'accés a l'habitatge a conseqüència de l'elevat preu, l'escassetat d'oferta adequada o la insuficiència d'ajudes locals.",null,null,null,"A.01 Efectes de la crisi econòmica, que ha afectat especialment la construcció del parc residencial, cosa que ha provocat escassetat d'habitatge nou o rehabilitat."]
[]
[null,null,"D.02 Escassetat d'habitatge social a preu assequible, amb un nombre d'habitatges insuficient subjecte a protecció pública per a llars amb baixos nivells de renda.",null,null,null,"A.02 Desequilibris en els centres històrics de les ciutats entre residents i visitants que poden afectar l'accés a l'habitatge, amb fenòmens com la gentrificació."]
[]
[null,null,"D.03 Baixa eficiència energètica, deficient conservació i problemes d'accessibilitat en una gran part del parc edificatori i, en particular, al parc d'habitatge.",null,null,null,"A.03 Dificultats per a accedir a l'habitatge de la població jove, la qual cosa dificulta l'emancipació i la formació de noves llars."]
[]
[null,null,"D.04 Existència d'àmbits d'infrahabitatge o assentaments irregulars, amb problemes de barraquisme i assentaments irregulars en determinats entorns urbans.",null,null,null,"A.04 Inadequació del parc d'habitatge existent a les persones majors, en el marc d'un fenomen d'envelliment de la població."]
[]
[null,null,"D.05 Condicionants específics de l'entorn que suposen barreres a l'edificació o rehabilitació, com pot ser el cas dels entorns d'elevada riquesa arqueològica.",null,null,null,"A.05 Complexitat i dispersió normativa a escala supramunicipal, en matèries com l'accessibilitat, l'eficiència energètica o la protecció del patrimoni."]
[]
[null,null,null,null,null,null,"A.06 Dificultat de les diferents administracions públiques per a mantindre i gestionar els parcs públics d'habitatge."]
[]
[]
[]
[]
[]
[]
[]
[]
[]
[]
[]
["FORTALESES",null,null,null,"OPORTUNITATS"]
[]
[null,null,"F.01 Actuacions recents de rehabilitació edificatòria del parc d'habitatges, en el marc de programes públics d'ajudes a escala local.",null,null,null,"O.01 Programes i polítiques autonòmiques, nacionals i europees de foment de la rehabilitació, regeneració i renovació urbana."]
[]
[null,null,"F.02 Elevada qualificació i coneixement en la promoció d'habitatge protegit, mitjançant experiències anteriors dutes a terme a la ciutat.",null,null,null,"O.02 Polítiques públiques i programes de promoció d'energies renovables i l'eficiència energètica en l'edificació i en els habitatges."]
[]
[null,null,"F.03 Capacitat d'atracció de la inversió productiva i de capital al sector de la construcció i la promoció immobiliària en l'àrea urbana.",null,null,null,"O.03 Programes nacionals, autonòmics i locals en matèria d'habitatge, com a marc per a l'aprovació d'incentius per a l'oferta d'habitatge en lloguer a preu assequible."]
[]
[null,null,"F.04 Actuacions integrades d'habitatge i sòl en zones urbanes degradades, en les quals s'han dut a terme accions de millora social, econòmica i ambiental.",null,null,null,"O.04 Reorientació del sector de la construcció cap a la rehabilitació edificatòria, caracteritzada per la major resistència a l'efecte de la crisi econòmica."]
[]
[null,null,"F.05 Increment de l'ús residencial del centre urbà, com a resultat d'operacions de regeneració o renovació urbanes desenvolupades en aquests entorns.",null,null,null,"O.05 Actuacions de promoció d'habitatge protegit tant de nova construcció, com especialment, de rehabilitació per a satisfer la demanda d'habitatge."]
[]
[null,null,"F.06 Ajust generalitzat del nivell de preus de l'habitatge, i del conjunt del mercat immobiliari en comparació amb els màxims aconseguits en 2006 i 2007.",null,null,null,"O.06 Fonts de finançament per a la millora i la conservació del patrimoni i del parc edificatori en zones històriques de les ciutats."]
[]
[]
[]
[]
[]
[]
[]
[]
[]
[]
[{"$f":"TABLAS!$AL$2","v":"FITXES PER A L'ELABORACIÓ D'UNA ESTRATÈGIA LOCAL DE REHABILITACIÓ DE L'ENTORN CONSTRUÏT"}]
[null,null,null,null,null,null,{"$f":"IF($G$2=\"\",\"\",$G$2)","v":"ETAPA II: ANÀLISI I DIAGNÒSTIC"}]
[null,null,null,null,null,null,{"$f":"TABLAS!$AL$4","v":""}]
[{"$f":"IF((COUNTA(A418:A436,E418:E436,A442:A460,E442:E460)>0),\"þ\",\"\")","v":""},null,"EIX 9. ERA DIGITAL"]
["DEBILITATS",null,null,null,"AMENACES"]
[]
[null,null,"D.01 Insuficient ritme d'incorporació de les TIC en l'àmbit local, especialment en l'entorn econòmic i en matèria de governança.",null,null,null,"A.01 Falta d'interés del sector empresarial per adaptar les actuals àrees de negoci a les noves tecnologies, la qual cosa pot repercutir en la seua capacitat d'adaptació."]
[]
[null,null,"D.02 Falta de serveis d'administració electrònica, que incideix en el model de governança local, en la participació ciutadana i en el seu apoderament.",null,null,null,"A.02 Augment del pes de la denominada quarta edat, que es configurarà com a col·lectiu social amb especials dificultats per a l'accés a les noves tecnologies."]
[]
[null,null,"D.03 Bretxa digital en sectors de la població, per la insuficiència o inadequació de la xarxa accés a Internet o per la inexistència de serveis digitals adequats.",null,null,null,"A.03 Escassa utilització, amb caràcter general, de l'Administració electrònica i de les aplicacions municipals per part dels ciutadans."]
[]
[null,null,"D.04 Escassa formació de la població en la utilització de les tecnologies de la informació, amb serioses implicacions i conseqüències en matèria de competitivitat local.",null,null,null,"A.04 Escassetat de recursos econòmics per a mantindre i transformar els serveis que presta l'Administració electrònica a escala local."]
[]
[null,null,"D.05 Escassa incorporació de les TIC en la gestió urbana, especialment, en algunes ciutats en què no s'ha avançat cap a les ciutats intel·ligents en els diferents àmbits.",null,null,null,"A.05 Sota aprofitament de les TIC com a element de cohesió social i de millora de les oportunitats dels col·lectius més desfavorits."]
[]
[null,null,"D.06 Insuficient penetració de la signatura electrònica en la societat.",null,null,null,"A.06 Problemes associats a la societat digital: plataformes en línia per a allotjament, activitats informals o delictives, control de dades, restriccions de llibertat…"]
[]
[null,null,"D.07 Insuficient nivell de digitalització dels destins i territoris turístics per a fer front a les necessitats de visitants nacionals i internacionals creixentment tecnificats.",null,null,null,"A.07 Desajustament entre les noves demandes i les solucions (immobiliàries, normatives, d'estoc), i aparició de demandes que requereixen noves ofertes (tipus, regles…)."]
[]
[]
[]
[]
[]
[]
[]
[]
[]
["FORTALESES",null,null,null,"OPORTUNITATS"]
[]
[null,null,"F.01 Iniciatives locals d'impuls de la gestió de serveis TIC, administració electrònica, ús de xarxes socials per a informar i donar servei als ciutadans, entre altres.",null,null,null,"O.01 Millora de l'eficiència en els serveis locals mitjançant l'Administració electrònica local, amb una simplificació de tràmits administratius i reducció de costos."]
[]
[null,null,"F.02 Pertinença de nombroses ciutats espanyoles a la xarxa de ciutats intel·ligents, la qual cosa posa de manifest l'interés per la modernització de l'administració local.",null,null,null,"O.02 Consolidació de la imatge de la ciutat com a ciutat intel·ligent, amb gran potencial de desenvolupament per a la implementació de mesures en tots els àmbits."]
[]
[null,null,"F.03 Bona competitivitat de les empreses vinculades a les TIC i a l'R+D+i, la qual cosa és un element clau per a l'orientació estratègica del teixit productiu local.",null,null,null,"O.03 Oportunitat d'aprofitar el talent format en l'àmbit universitari, com a palanca per a impulsar la innovació i la transformació de la ciutat."]
[]
[null,null,"F.04 Existència d'un teixit industrial amb perfil adaptat a la innovació, per la proximitat de parcs científics o tecnològics o centres d'innovació.",null,null,null,"O.04 Aconseguir un major treball en xarxa d'Administració, empreses i ciutadans, mitjançant noves estratègies de comunicació en l'era digital."]
[]
[null,null,"F.05 Motivació ciutadana per a la utilització de les TIC, en un context d'interés i extensió de noves iniciatives i projectes, per exemple, en l'àmbit de la mobilitat.",null,null,null,"O.05 Iniciatives per a l'ús de les TIC en l'activitat turística i afavorir la dinamització del turisme industrial o de negocis associat a l'oferta tecnològica i industrial."]
[]
[null,null,null,null,null,null,"O.06 Fomentar l'ús de les TIC entre la població, mitjançant la realització de campanyes d'informació per a la seua utilització o cursos de formació a determinats col·lectius."]
[]
[null,null,null,null,null,null,"O.07 Potenciar la innovació en sectors tradicionals, especialment en el sector comercial de grandària mitjana i xicoteta, mitjançant una major introducció les TIC."]
[]
[null,null,null,null,null,null,"O.08 Important recorregut de millora en l'àmbit de digitalització dels territoris, que permetrà una millor gestió dels serveis."]
[]
[]
[]
[]
[]
[]
[{"$f":"TABLAS!$AL$2","v":"FITXES PER A L'ELABORACIÓ D'UNA ESTRATÈGIA LOCAL DE REHABILITACIÓ DE L'ENTORN CONSTRUÏT"}]
[null,null,null,null,null,null,{"$f":"IF($G$2=\"\",\"\",$G$2)","v":"ETAPA II: ANÀLISI I DIAGNÒSTIC"}]
[null,null,null,null,null,null,{"$f":"TABLAS!$AL$4","v":""}]
[{"$f":"IF((COUNTA(A469:A487,E469:E487,A493:A510,E493:E510)>0),\"þ\",\"\")","v":""},null,"EIX 10. INSTRUMENTS I GOVERNANÇA"]
["DEBILITATS",null,null,null,"AMENACES"]
[]
[null,null,"D.01 Sistema normatiu complex i heterogeni en matèria urbanística, que dificulta l'aplicació dels diferents plans i la gestió urbanística local.",null,null,null,"A.01 Falta de flexibilitat en els instruments de planificació, per a adaptar els plans a noves demandes o necessitats no previstes, que puguen sorgir a la ciutat."]
[]
[null,null,"D.02 Excessiva extensió dels terminis de tramitació de plans urbanístics, que produeix un desfasament entre l'aplicació dels plans i les necessitats previstes en aquests.",null,null,null,"A.02 Planificació territorial insuficient o deficient, amb una absència de coordinació entre instruments de caràcter supramunicipal i instruments locals."]
[]
[null,null,"D.03 Estructura i capacitat de les entitats locals insuficient per a accedir a fonts de finançament, així com per a gestionar-les.",null,null,null,"A.03 Rigidesa normativa i administrativa per a la reutilització de dotacions i espais públics, i per a la inserció de nous usos en cas d'“infrautilització”."]
[]
[null,null,null,null,null,null,"A.04 Difícil convivència de les diferents planificacions sectorials i la planificació local."]
[]
[]
[]
[]
[]
[]
[]
[]
[]
[]
[]
[]
[]
[]
[]
["FORTALESES",null,null,null,"OPORTUNITATS"]
[]
[null,null,"F.01 Experiència en iniciatives de desenvolupament sostenible i utilització d'instruments de planificació urbanística i territorial.",null,null,null,"O.01 Polítiques autonòmiques i nacionals en relació a la rehabilitació, regeneració i renovació urbana que fomenten un desenvolupament urbà sostenible."]
[]
[null,null,"F.02 Existència d'institucions i estructures que generen processos d'innovació i de creativitat, com l'àmbit universitari i acadèmic o de la investigació aplicada.",null,null,null,"O.02 Millora de l'eficiència en els serveis locals mitjançant l'Administració electrònica local, amb una simplificació de tràmits administratius i reducció de costos."]
[]
[null,null,"F.03 Existència de plans municipals en algunes ciutats per a la rehabilitació urbana i d'habitatges, amb freqüència, orientats a la intervenció en determinades zones urbanes.",null,null,null,"O.03 Elaboració de nous Plans Territorials Integrats i instruments d'ordenació del territori en zones de noves sinergies i influències entre ciutats."]
[]
[null,null,"F.04 Revisió dels instruments de planejament urbanístic, per a adequar-los a la realitat actual, incloent-hi en ocasions iniciatives de desclassificació de sòl.",null,null,null,"O.04 Procurar una major imbricació entre les polítiques i perspectives d'actuació de la ciutat i del territori (mobilitat, medi ambient, turisme…)."]
[]
[null,null,"F.05 Model descentralitzat espanyol, que permet a les administracions públiques adaptar-se a les necessitats i al model urbà específic.",null,null,null,"O.05 Utilització de l'Agenda Urbana Espanyola per a integrar i conciliar les polítiques, plans, programes i actuacions relacionades amb els diferents objectius estratègics."]
[]
[null,null,"F.06 Existència de polítiques, plans, programes i actuacions relacionades amb els diferents eixos estratègics d'aquesta Agenda Urbana Espanyola.",null,null,null,"O.06 Iniciatives per a integració de les TIC en la gestió de les destinacions turístiques per a millorar-ne la planificació."]
[]
[null,null,"F.07 Existència d'un Programa Nacional de Destinacions Turístiques Intel·ligents per a la millora de la governança i competitivitat de les destinacions turístiques a Espanya."]

{"sheet":"ETAPA II.i","index":7,"n_rows":9,"n_cols":5,"rows_kept":9,"cut":false,"hidden":false,"merged":[[2,2,2,4],[9,0,53,4],[5,0,5,4],[6,0,6,4]]}
[null,null,null,null,{"$f":"TABLAS!$AL$2","v":"FITXES PER A L'ELABORACIÓ D'UNA ESTRATÈGIA LOCAL DE REHABILITACIÓ DE L'ENTORN CONSTRUÏT"}]
[null,null,null,null,{"$f":"TABLAS!$AL$5","v":"ETAPA II: ANÀLISI I DIAGNÒSTIC"}]
[null,null,{"$f":"TABLAS!$AL$4","v":""}]
["II.i  Conclusions extretes del procés participatiu"]
[]
["S'ha aconseguit un elevat grau de consens amb les diferents administracions actuants, així com amb els sectors involucrats de la societat civil (associacions veïnals i ciutadanes, banca, empreses del sector, etc.) per al desenvolupament de les actuacions?"]
[]
[]
["Conclusions:"]

{"sheet":"ETAPA III.a","index":8,"n_rows":224,"n_cols":15,"rows_kept":224,"cut":false,"hidden":false,"merged":[[0,0,0,9],[5,1,5,4],[9,1,9,4],[3,8,3,9],[7,3,7,4],[9,6,9,9],[2,4,2,9],[21,3,21,4],[23,1,23,4],[23,6,23,9],[26,1,26,4],[28,3,28,4],[12,1,12,4],[14,3,14,4],[16,1,16,4],[16,6,16,9],[19,1,19,4],[40,1,40,4],[42,3,42,4],[44,1,44,4],[44,6,44,9],[46,0,46,9],[30,1,30,4],[30,6,30,9],[33,1,33,4],[35,3,35,4],[37,1,37,4],[37,6,37,9],[57,1,57,4],[59,3,59,4],[61,1,61,4],[61,6,61,9],[64,1,64,4],[50,1,50,4],[52,3,52,4],[54,1,54,4],[54,6,54,9],[75,1,75,4],[75,6,75,9],[78,1,78,4],[80,3,80,4],[82,1,82,4],[82,6,82,9],[66,3,66,4],[68,1,68,4],[68,6,68,9],[71,1,71,4],[73,3,73,4],[95,1,95,4],[97,3,97,4],[99,1,99,4],[99,6,99,9],[85,1,85,4],[87,3,87,4],[89,1,89,4],[89,6,89,9],[91,0,91,9],[111,3,111,4],[113,1,113,4],[113,6,113,9],[116,1,116,4],[118,3,118,4],[102,1,102,4],[104,3,104,4],[106,1,106,4],[106,6,106,9],[109,1,109,4],[130,1,130,4],[132,3,132,4],[134,1,134,4],[134,6,134,9],[136,0,136,9],[120,1,120,4],[120,6,120,9],[123,1,123,4],[125,3,125,4],[127,1,127,4],[127,6,127,9],[147,1,147,4],[149,3,149,4],[151,1,151,4],[151,6,151,9],[154,1,154,4],[140,1,140,4],[142,3,142,4],[144,1,144,4],[144,6,144,9],[165,1,165,4],[165,6,165,9],[168,1,168,4],[170,3,170,4],[172,1,172,4],[172,6,172,9],[156,3,156,4],[158,1,158,4],[158,6,158,9],[161,1,161,4],[163,3,163,4],[185,1,185,4],[187,3,187,4],[189,1,189,4],[189,6,189,9],[175,1,175,4],[177,3,177,4],[179,1,179,4],[179,6,179,9],[181,0,181,9],[48,4,48,9],[93,4,93,9],[138,4,138,9],[183,4,183,9],[220,1,220,4],[222,3,222,4],[224,1,224,4],[224,6,224,9],[210,1,210,4],[210,6,210,9],[213,1,213,4],[215,3,215,4],[217,1,217,4],[217,6,217,9],[201,3,201,4],[203,1,203,4],[203,6,203,9],[206,1,206,4],[208,3,208,4],[192,1,192,4],[194,3,194,4],[196,1,196,4],[196,6,196,9],[199,1,199,4]]}
[{"$f":"TABLAS!$AL$2","v":"FITXES PER A L'ELABORACIÓ D'UNA ESTRATÈGIA LOCAL DE REHABILITACIÓ DE L'ENTORN CONSTRUÏT"},null,null,null,null,null,null,null,null,null,"OCULTAR","OCULTAR","OCULTAR","OCULTAR","OCULTAR"]
[null,null,null,null,null,null,null,null,null,{"$f":"TABLAS!$AL$6","v":"ETAPA III: PROGRAMA D'ACTUACIONS"}]
[null,null,null,null,{"$f":"TABLAS!$AL$4","v":""}]
["III.a Accions",null,null,null,null,null,null,"Nre. d'accions:",6]
["Codi","Acció: Objectiu i resultats",null,null,null,"Prioritat","Pressupost","Any d'inici","Trimestre d'inici","Duració\nTrimestres","Acción","€/trimestre","COL inicio","COL final","CONTROL III.a"]
[{"$f":"CONCATENATE(\"A.\",K6)","v":"A.1"},null,null,null,null,null,null,null,null,null,1,{"$f":"IFERROR(G6/J6,\"\")","v":""},{"$f":"MATCH(H6,'ETAPA III.b'!B$9:AO$9,0)+COLUMN('ETAPA III.b'!A$7)+RIGHT(I6,1)-1","v":{"$error":"#N/A"}},{"$f":"MATCH(H6,'ETAPA III.b'!B$9:AO$9,0)+COLUMN('ETAPA III.b'!A$7)+RIGHT(I6,1)-1+J6-1","v":{"$error":"#N/A"}},{"$f":"OR($I$4<K6,COUNTA(B6:J6,B8)=7)","v":false}]
[null,"DAFO",null,"Línies d'actuació"]
[null,null,null,{"$f":"_xlfn.TEXTJOIN(\", \",TRUE,IF(INDIRECT(CONCATENATE(\"'ETAPA III.a_'!\",SUBSTITUTE(ADDRESS(1,MATCH(A6,'ETAPA III.a_'!$5:$5,0),4),1,\"\"),\":\",SUBSTITUTE(ADDRESS(1,MATCH(A6,'ETAPA III.a_'!$5:$5,0),4),1,\"\")))=\"X\",'ETAPA III.a_'!A:A,\"\"))","v":""},null,null,null,null,null,{"$f":"IFERROR(IF(N6>41,\"Error: El final de esta acción sobrepasa el T4 de 2030.\",IF(O6=FALSE,\"Error: Falten dades per omplir d'esta acció.\",\"\")),IF(O6=FALSE,\"Error: Falten dades per omplir d'esta acció.\",\"\"))","v":"Error: Falten dades per omplir d'esta acció."}]
[null,"Relació de l'acció amb les debilitats, amenaça, fortaleses o oportunitats del DAFO",null,null,null,null,"Fonts de finançament previstes"]
[]
[]
["Codi","Acció: Objectiu i resultats",null,null,null,"Prioritat","Pressupost","Any d'inici","Trimestre d'inici","Duració\nTrimestres"]
[{"$f":"CONCATENATE(\"A.\",K13)","v":"A.2"},null,null,null,null,null,null,null,null,null,{"$f":"K6+1","v":2},{"$f":"IFERROR(G13/J13,\"\")","v":""},{"$f":"MATCH(H13,'ETAPA III.b'!B$9:AO$9,0)+COLUMN('ETAPA III.b'!A$7)+RIGHT(I13,1)-1","v":{"$error":"#N/A"}},{"$f":"MATCH(H13,'ETAPA III.b'!B$9:AO$9,0)+COLUMN('ETAPA III.b'!A$7)+RIGHT(I13,1)-1+J13-1","v":{"$error":"#N/A"}},{"$f":"OR($I$4<K13,COUNTA(B13:J13,B15)=7)","v":false}]
[null,"DAFO",null,"Línies d'actuació"]
[null,null,null,{"$f":"_xlfn.TEXTJOIN(\", \",TRUE,IF(INDIRECT(CONCATENATE(\"'ETAPA III.a_'!\",SUBSTITUTE(ADDRESS(1,MATCH(A13,'ETAPA III.a_'!$5:$5,0),4),1,\"\"),\":\",SUBSTITUTE(ADDRESS(1,MATCH(A13,'ETAPA III.a_'!$5:$5,0),4),1,\"\")))=\"X\",'ETAPA III.a_'!A:A,\"\"))","v":""},null,null,null,null,null,{"$f":"IFERROR(IF(N13>41,\"Error: El final de esta acción sobrepasa el T4 de 2030.\",IF(O13=FALSE,\"Error: Falten dades per omplir d'esta acció.\",\"\")),IF(O13=FALSE,\"Error: Falten dades per omplir d'esta acció.\",\"\"))","v":"Error: Falten dades per omplir d'esta acció."}]
[null,"Relació de l'acció amb les debilitats, amenaça, fortaleses o oportunitats del DAFO",null,null,null,null,"Fonts de finançament previstes"]
[]
[]
["Codi","Acció: Objectiu i resultats",null,null,null,"Prioritat","Pressupost","Any d'inici","Trimestre d'inici","Duració\nTrimestres"]
[{"$f":"CONCATENATE(\"A.\",K20)","v":"A.3"},null,null,null,null,null,null,null,null,null,{"$f":"K13+1","v":3},{"$f":"IFERROR(G20/J20,\"\")","v":""},{"$f":"MATCH(H20,'ETAPA III.b'!B$9:AO$9,0)+COLUMN('ETAPA III.b'!A$7)+RIGHT(I20,1)-1","v":{"$error":"#N/A"}},{"$f":"MATCH(H20,'ETAPA III.b'!B$9:AO$9,0)+COLUMN('ETAPA III.b'!A$7)+RIGHT(I20,1)-1+J20-1","v":{"$error":"#N/A"}},{"$f":"OR($I$4<K20,COUNTA(B20:J20,B22)=7)","v":false}]
[null,"DAFO",null,"Línies d'actuació"]
[null,null,null,{"$f":"_xlfn.TEXTJOIN(\", \",TRUE,IF(INDIRECT(CONCATENATE(\"'ETAPA III.a_'!\",SUBSTITUTE(ADDRESS(1,MATCH(A20,'ETAPA III.a_'!$5:$5,0),4),1,\"\"),\":\",SUBSTITUTE(ADDRESS(1,MATCH(A20,'ETAPA III.a_'!$5:$5,0),4),1,\"\")))=\"X\",'ETAPA III.a_'!A:A,\"\"))","v":""},null,null,null,null,null,{"$f":"IFERROR(IF(N20>41,\"Error: El final de esta acción sobrepasa el T4 de 2030.\",IF(O20=FALSE,\"Error: Falten dades per omplir d'esta acció.\",\"\")),IF(O20=FALSE,\"Error: Falten dades per omplir d'esta acció.\",\"\"))","v":"Error: Falten dades per omplir d'esta acció."}]
[null,"Relació de l'acció amb les debilitats, amenaça, fortaleses o oportunitats del DAFO",null,null,null,null,"Fonts de finançament previstes"]
[]
[]
["Codi","Acció: Objectiu i resultats",null,null,null,"Prioritat","Pressupost","Any d'inici","Trimestre d'inici","Duració\nTrimestres"]
[{"$f":"CONCATENATE(\"A.\",K27)","v":"A.4"},null,null,null,null,null,null,null,null,null,{"$f":"K20+1","v":4},{"$f":"IFERROR(G27/J27,\"\")","v":""},{"$f":"MATCH(H27,'ETAPA III.b'!B$9:AO$9,0)+COLUMN('ETAPA III.b'!A$7)+RIGHT(I27,1)-1","v":{"$error":"#N/A"}},{"$f":"MATCH(H27,'ETAPA III.b'!B$9:AO$9,0)+COLUMN('ETAPA III.b'!A$7)+RIGHT(I27,1)-1+J27-1","v":{"$error":"#N/A"}},{"$f":"OR($I$4<K27,COUNTA(B27:J27,B29)=7)","v":false}]
[null,"DAFO",null,"Línies d'actuació"]
[null,null,null,{"$f":"_xlfn.TEXTJOIN(\", \",TRUE,IF(INDIRECT(CONCATENATE(\"'ETAPA III.a_'!\",SUBSTITUTE(ADDRESS(1,MATCH(A27,'ETAPA III.a_'!$5:$5,0),4),1,\"\"),\":\",SUBSTITUTE(ADDRESS(1,MATCH(A27,'ETAPA III.a_'!$5:$5,0),4),1,\"\")))=\"X\",'ETAPA III.a_'!A:A,\"\"))","v":""},null,null,null,null,null,{"$f":"IFERROR(IF(N27>41,\"Error: El final de esta acción sobrepasa el T4 de 2030.\",IF(O27=FALSE,\"Error: Falten dades per omplir d'esta acció.\",\"\")),IF(O27=FALSE,\"Error: Falten dades per omplir d'esta acció.\",\"\"))","v":"Error: Falten dades per omplir d'esta acció."}]
[null,"Relació de l'acció amb les debilitats, amenaça, fortaleses o oportunitats del DAFO",null,null,null,null,"Fonts de finançament previstes"]
[]
[]
["Codi","Acció: Objectiu i resultats",null,null,null,"Prioritat","Pressupost","Any d'inici","Trimestre d'inici","Duració\nTrimestres"]
[{"$f":"CONCATENATE(\"A.\",K34)","v":"A.5"},null,null,null,null,null,null,null,null,null,{"$f":"K27+1","v":5},{"$f":"IFERROR(G34/J34,\"\")","v":""},{"$f":"MATCH(H34,'ETAPA III.b'!B$9:AO$9,0)+COLUMN('ETAPA III.b'!A$7)+RIGHT(I34,1)-1","v":{"$error":"#N/A"}},{"$f":"MATCH(H34,'ETAPA III.b'!B$9:AO$9,0)+COLUMN('ETAPA III.b'!A$7)+RIGHT(I34,1)-1+J34-1","v":{"$error":"#N/A"}},{"$f":"OR($I$4<K34,COUNTA(B34:J34,B36)=7)","v":false}]
[null,"DAFO",null,"Línies d'actuació"]
[null,null,null,{"$f":"_xlfn.TEXTJOIN(\", \",TRUE,IF(INDIRECT(CONCATENATE(\"'ETAPA III.a_'!\",SUBSTITUTE(ADDRESS(1,MATCH(A34,'ETAPA III.a_'!$5:$5,0),4),1,\"\"),\":\",SUBSTITUTE(ADDRESS(1,MATCH(A34,'ETAPA III.a_'!$5:$5,0),4),1,\"\")))=\"X\",'ETAPA III.a_'!A:A,\"\"))","v":""},null,null,null,null,null,{"$f":"IFERROR(IF(N34>41,\"Error: El final de esta acción sobrepasa el T4 de 2030.\",IF(O34=FALSE,\"Error: Falten dades per omplir d'esta acció.\",\"\")),IF(O34=FALSE,\"Error: Falten dades per omplir d'esta acció.\",\"\"))","v":"Error: Falten dades per omplir d'esta acció."}]
[null,"Relació de l'acció amb les debilitats, amenaça, fortaleses o oportunitats del DAFO",null,null,null,null,"Fonts de finançament previstes"]
[]
[]
["Codi","Acció: Objectiu i resultats",null,null,null,"Prioritat","Pressupost","Any d'inici","Trimestre d'inici","Duració\nTrimestres"]
[{"$f":"CONCATENATE(\"A.\",K41)","v":"A.6"},null,null,null,null,null,null,null,null,null,{"$f":"K34+1","v":6},{"$f":"IFERROR(G41/J41,\"\")","v":""},{"$f":"MATCH(H41,'ETAPA III.b'!B$9:AO$9,0)+COLUMN('ETAPA III.b'!A$7)+RIGHT(I41,1)-1","v":{"$error":"#N/A"}},{"$f":"MATCH(H41,'ETAPA III.b'!B$9:AO$9,0)+COLUMN('ETAPA III.b'!A$7)+RIGHT(I41,1)-1+J41-1","v":{"$error":"#N/A"}},{"$f":"OR($I$4<K41,COUNTA(B41:J41,B43)=7)","v":false}]
[null,"DAFO",null,"Línies d'actuació"]
[null,null,null,{"$f":"_xlfn.TEXTJOIN(\", \",TRUE,IF(INDIRECT(CONCATENATE(\"'ETAPA III.a_'!\",SUBSTITUTE(ADDRESS(1,MATCH(A41,'ETAPA III.a_'!$5:$5,0),4),1,\"\"),\":\",SUBSTITUTE(ADDRESS(1,MATCH(A41,'ETAPA III.a_'!$5:$5,0),4),1,\"\")))=\"X\",'ETAPA III.a_'!A:A,\"\"))","v":""},null,null,null,null,null,{"$f":"IFERROR(IF(N41>41,\"Error: El final de esta acción sobrepasa el T4 de 2030.\",IF(O41=FALSE,\"Error: Falten dades per omplir d'esta acció.\",\"\")),IF(O41=FALSE,\"Error: Falten dades per omplir d'esta acció.\",\"\"))","v":"Error: Falten dades per omplir d'esta acció."}]
[null,"Relació de l'acció amb les debilitats, amenaça, fortaleses o oportunitats del DAFO",null,null,null,null,"Fonts de finançament previstes"]
[]
[]
[{"$f":"TABLAS!$AL$2","v":"FITXES PER A L'ELABORACIÓ D'UNA ESTRATÈGIA LOCAL DE REHABILITACIÓ DE L'ENTORN CONSTRUÏT"}]
[null,null,null,null,null,null,null,null,null,{"$f":"IF($J$2=\"\",\"\",$J$2)","v":"ETAPA III: PROGRAMA D'ACTUACIONS"}]
[null,null,null,null,{"$f":"TABLAS!$AL$4","v":""}]
["Codi","Acció: Objectiu i resultats",null,null,null,"Prioritat","Pressupost","Any d'inici","Trimestre d'inici","Duració\nTrimestres"]
[{"$f":"CONCATENATE(\"A.\",K51)","v":"A.7"},null,null,null,null,null,null,null,null,null,{"$f":"K41+1","v":7},{"$f":"IFERROR(G51/J51,\"\")","v":""},{"$f":"MATCH(H51,'ETAPA III.b'!B$9:AO$9,0)+COLUMN('ETAPA III.b'!A$7)+RIGHT(I51,1)-1","v":{"$error":"#N/A"}},{"$f":"MATCH(H51,'ETAPA III.b'!B$9:AO$9,0)+COLUMN('ETAPA III.b'!A$7)+RIGHT(I51,1)-1+J51-1","v":{"$error":"#N/A"}},{"$f":"OR($I$4<K51,COUNTA(B51:J51,B53)=7)","v":true}]
[null,"DAFO",null,"Línies d'actuació"]
[null,null,null,{"$f":"_xlfn.TEXTJOIN(\", \",TRUE,IF(INDIRECT(CONCATENATE(\"'ETAPA III.a_'!\",SUBSTITUTE(ADDRESS(1,MATCH(A51,'ETAPA III.a_'!$5:$5,0),4),1,\"\"),\":\",SUBSTITUTE(ADDRESS(1,MATCH(A51,'ETAPA III.a_'!$5:$5,0),4),1,\"\")))=\"X\",'ETAPA III.a_'!A:A,\"\"))","v":""},null,null,null,null,null,{"$f":"IFERROR(IF(N51>41,\"Error: El final de esta acción sobrepasa el T4 de 2030.\",IF(O51=FALSE,\"Error: Falten dades per omplir d'esta acció.\",\"\")),IF(O51=FALSE,\"Error: Falten dades per omplir d'esta acció.\",\"\"))","v":""}]
[null,"Relació de l'acció amb les debilitats, amenaça, fortaleses o oportunitats del DAFO",null,null,null,null,"Fonts de finançament previstes"]
[]
[]
["Codi","Acció: Objectiu i resultats",null,null,null,"Prioritat","Pressupost","Any d'inici","Trimestre d'inici","Duració\nTrimestres"]
[{"$f":"CONCATENATE(\"A.\",K58)","v":"A.8"},null,null,null,null,null,null,null,null,null,{"$f":"K51+1","v":8},{"$f":"IFERROR(G58/J58,\"\")","v":""},{"$f":"MATCH(H58,'ETAPA III.b'!B$9:AO$9,0)+COLUMN('ETAPA III.b'!A$7)+RIGHT(I58,1)-1","v":{"$error":"#N/A"}},{"$f":"MATCH(H58,'ETAPA III.b'!B$9:AO$9,0)+COLUMN('ETAPA III.b'!A$7)+RIGHT(I58,1)-1+J58-1","v":{"$error":"#N/A"}},{"$f":"OR($I$4<K58,COUNTA(B58:J58,B60)=7)","v":true}]
[null,"DAFO",null,"Línies d'actuació"]
[null,null,null,{"$f":"_xlfn.TEXTJOIN(\", \",TRUE,IF(INDIRECT(CONCATENATE(\"'ETAPA III.a_'!\",SUBSTITUTE(ADDRESS(1,MATCH(A58,'ETAPA III.a_'!$5:$5,0),4),1,\"\"),\":\",SUBSTITUTE(ADDRESS(1,MATCH(A58,'ETAPA III.a_'!$5:$5,0),4),1,\"\")))=\"X\",'ETAPA III.a_'!A:A,\"\"))","v":""},null,null,null,null,null,{"$f":"IFERROR(IF(N58>41,\"Error: El final de esta acción sobrepasa el T4 de 2030.\",IF(O58=FALSE,\"Error: Falten dades per omplir d'esta acció.\",\"\")),IF(O58=FALSE,\"Error: Falten dades per omplir d'esta acció.\",\"\"))","v":""}]
[null,"Relació de l'acció amb les debilitats, amenaça, fortaleses o oportunitats del DAFO",null,null,null,null,"Fonts de finançament previstes"]
[]
[]
["Codi","Acció: Objectiu i resultats",null,null,null,"Prioritat","Pressupost","Any d'inici","Trimestre d'inici","Duració\nTrimestres"]
[{"$f":"CONCATENATE(\"A.\",K65)","v":"A.9"},null,null,null,null,null,null,null,null,null,{"$f":"K58+1","v":9},{"$f":"IFERROR(G65/J65,\"\")","v":""},{"$f":"MATCH(H65,'ETAPA III.b'!B$9:AO$9,0)+COLUMN('ETAPA III.b'!A$7)+RIGHT(I65,1)-1","v":{"$error":"#N/A"}},{"$f":"MATCH(H65,'ETAPA III.b'!B$9:AO$9,0)+COLUMN('ETAPA III.b'!A$7)+RIGHT(I65,1)-1+J65-1","v":{"$error":"#N/A"}},{"$f":"OR($I$4<K65,COUNTA(B65:J65,B67)=7)","v":true}]
[null,"DAFO",null,"Línies d'actuació"]
[null,null,null,{"$f":"_xlfn.TEXTJOIN(\", \",TRUE,IF(INDIRECT(CONCATENATE(\"'ETAPA III.a_'!\",SUBSTITUTE(ADDRESS(1,MATCH(A65,'ETAPA III.a_'!$5:$5,0),4),1,\"\"),\":\",SUBSTITUTE(ADDRESS(1,MATCH(A65,'ETAPA III.a_'!$5:$5,0),4),1,\"\")))=\"X\",'ETAPA III.a_'!A:A,\"\"))","v":""},null,null,null,null,null,{"$f":"IFERROR(IF(N65>41,\"Error: El final de esta acción sobrepasa el T4 de 2030.\",IF(O65=FALSE,\"Error: Falten dades per omplir d'esta acció.\",\"\")),IF(O65=FALSE,\"Error: Falten dades per omplir d'esta acció.\",\"\"))","v":""}]
[null,"Relació de l'acció amb les debilitats, amenaça, fortaleses o oportunitats del DAFO",null,null,null,null,"Fonts de finançament previstes"]
[]
[]
["Codi","Acció: Objectiu i resultats",null,null,null,"Prioritat","Pressupost","Any d'inici","Trimestre d'inici","Duració\nTrimestres"]
[{"$f":"CONCATENATE(\"A.\",K72)","v":"A.10"},null,null,null,null,null,null,null,null,null,{"$f":"K65+1","v":10},{"$f":"IFERROR(G72/J72,\"\")","v":""},{"$f":"MATCH(H72,'ETAPA III.b'!B$9:AO$9,0)+COLUMN('ETAPA III.b'!A$7)+RIGHT(I72,1)-1","v":{"$error":"#N/A"}},{"$f":"MATCH(H72,'ETAPA III.b'!B$9:AO$9,0)+COLUMN('ETAPA III.b'!A$7)+RIGHT(I72,1)-1+J72-1","v":{"$error":"#N/A"}},{"$f":"OR($I$4<K72,COUNTA(B72:J72,B74)=7)","v":true}]
[null,"DAFO",null,"Línies d'actuació"]
[null,null,null,{"$f":"_xlfn.TEXTJOIN(\", \",TRUE,IF(INDIRECT(CONCATENATE(\"'ETAPA III.a_'!\",SUBSTITUTE(ADDRESS(1,MATCH(A72,'ETAPA III.a_'!$5:$5,0),4),1,\"\"),\":\",SUBSTITUTE(ADDRESS(1,MATCH(A72,'ETAPA III.a_'!$5:$5,0),4),1,\"\")))=\"X\",'ETAPA III.a_'!A:A,\"\"))","v":""},null,null,null,null,null,{"$f":"IFERROR(IF(N72>41,\"Error: El final de esta acción sobrepasa el T4 de 2030.\",IF(O72=FALSE,\"Error: Falten dades per omplir d'esta acció.\",\"\")),IF(O72=FALSE,\"Error: Falten dades per omplir d'esta acció.\",\"\"))","v":""}]
[null,"Relació de l'acció amb les debilitats, amenaça, fortaleses o oportunitats del DAFO",null,null,null,null,"Fonts de finançament previstes"]
[]
[]
["Codi","Acció: Objectiu i resultats",null,null,null,"Prioritat","Pressupost","Any d'inici","Trimestre d'inici","Duració\nTrimestres"]
[{"$f":"CONCATENATE(\"A.\",K79)","v":"A.11"},null,null,null,null,null,null,null,null,null,{"$f":"K72+1","v":11},{"$f":"IFERROR(G79/J79,\"\")","v":""},{"$f":"MATCH(H79,'ETAPA III.b'!B$9:AO$9,0)+COLUMN('ETAPA III.b'!A$7)+RIGHT(I79,1)-1","v":{"$error":"#N/A"}},{"$f":"MATCH(H79,'ETAPA III.b'!B$9:AO$9,0)+COLUMN('ETAPA III.b'!A$7)+RIGHT(I79,1)-1+J79-1","v":{"$error":"#N/A"}},{"$f":"OR($I$4<K79,COUNTA(B79:J79,B81)=7)","v":true}]
[null,"DAFO",null,"Línies d'actuació"]
[null,null,null,{"$f":"_xlfn.TEXTJOIN(\", \",TRUE,IF(INDIRECT(CONCATENATE(\"'ETAPA III.a_'!\",SUBSTITUTE(ADDRESS(1,MATCH(A79,'ETAPA III.a_'!$5:$5,0),4),1,\"\"),\":\",SUBSTITUTE(ADDRESS(1,MATCH(A79,'ETAPA III.a_'!$5:$5,0),4),1,\"\")))=\"X\",'ETAPA III.a_'!A:A,\"\"))","v":""},null,null,null,null,null,{"$f":"IFERROR(IF(N79>41,\"Error: El final de esta acción sobrepasa el T4 de 2030.\",IF(O79=FALSE,\"Error: Falten dades per omplir d'esta acció.\",\"\")),IF(O79=FALSE,\"Error: Falten dades per omplir d'esta acció.\",\"\"))","v":""}]
[null,"Relació de l'acció amb les debilitats, amenaça, fortaleses o oportunitats del DAFO",null,null,null,null,"Fonts de finançament previstes"]
[]
[]
["Codi","Acció: Objectiu i resultats",null,null,null,"Prioritat","Pressupost","Any d'inici","Trimestre d'inici","Duració\nTrimestres"]
[{"$f":"CONCATENATE(\"A.\",K86)","v":"A.12"},null,null,null,null,null,null,null,null,null,{"$f":"K79+1","v":12},{"$f":"IFERROR(G86/J86,\"\")","v":""},{"$f":"MATCH(H86,'ETAPA III.b'!B$9:AO$9,0)+COLUMN('ETAPA III.b'!A$7)+RIGHT(I86,1)-1","v":{"$error":"#N/A"}},{"$f":"MATCH(H86,'ETAPA III.b'!B$9:AO$9,0)+COLUMN('ETAPA III.b'!A$7)+RIGHT(I86,1)-1+J86-1","v":{"$error":"#N/A"}},{"$f":"OR($I$4<K86,COUNTA(B86:J86,B88)=7)","v":true}]
[null,"DAFO",null,"Línies d'actuació"]
[null,null,null,{"$f":"_xlfn.TEXTJOIN(\", \",TRUE,IF(INDIRECT(CONCATENATE(\"'ETAPA III.a_'!\",SUBSTITUTE(ADDRESS(1,MATCH(A86,'ETAPA III.a_'!$5:$5,0),4),1,\"\"),\":\",SUBSTITUTE(ADDRESS(1,MATCH(A86,'ETAPA III.a_'!$5:$5,0),4),1,\"\")))=\"X\",'ETAPA III.a_'!A:A,\"\"))","v":""},null,null,null,null,null,{"$f":"IFERROR(IF(N86>41,\"Error: El final de esta acción sobrepasa el T4 de 2030.\",IF(O86=FALSE,\"Error: Falten dades per omplir d'esta acció.\",\"\")),IF(O86=FALSE,\"Error: Falten dades per omplir d'esta acció.\",\"\"))","v":""}]
[null,"Relació de l'acció amb les debilitats, amenaça, fortaleses o oportunitats del DAFO",null,null,null,null,"Fonts de finançament previstes"]
[]
[]
[{"$f":"TABLAS!$AL$2","v":"FITXES PER A L'ELABORACIÓ D'UNA ESTRATÈGIA LOCAL DE REHABILITACIÓ DE L'ENTORN CONSTRUÏT"}]
[null,null,null,null,null,null,null,null,null,{"$f":"IF($J$2=\"\",\"\",$J$2)","v":"ETAPA III: PROGRAMA D'ACTUACIONS"}]
[null,null,null,null,{"$f":"TABLAS!$AL$4","v":""}]
["Codi","Acció: Objectiu i resultats",null,null,null,"Prioritat","Pressupost","Any d'inici","Trimestre d'inici","Duració\nTrimestres"]
[{"$f":"CONCATENATE(\"A.\",K96)","v":"A.13"},null,null,null,null,null,null,null,null,null,{"$f":"K86+1","v":13},{"$f":"IFERROR(G96/J96,\"\")","v":""},{"$f":"MATCH(H96,'ETAPA III.b'!B$9:AO$9,0)+COLUMN('ETAPA III.b'!A$7)+RIGHT(I96,1)-1","v":{"$error":"#N/A"}},{"$f":"MATCH(H96,'ETAPA III.b'!B$9:AO$9,0)+COLUMN('ETAPA III.b'!A$7)+RIGHT(I96,1)-1+J96-1","v":{"$error":"#N/A"}},{"$f":"OR($I$4<K96,COUNTA(B96:J96,B98)=7)","v":true}]
[null,"DAFO",null,"Línies d'actuació"]
[null,null,null,{"$f":"_xlfn.TEXTJOIN(\", \",TRUE,IF(INDIRECT(CONCATENATE(\"'ETAPA III.a_'!\",SUBSTITUTE(ADDRESS(1,MATCH(A96,'ETAPA III.a_'!$5:$5,0),4),1,\"\"),\":\",SUBSTITUTE(ADDRESS(1,MATCH(A96,'ETAPA III.a_'!$5:$5,0),4),1,\"\")))=\"X\",'ETAPA III.a_'!A:A,\"\"))","v":""},null,null,null,null,null,{"$f":"IFERROR(IF(N96>41,\"Error: El final de esta acción sobrepasa el T4 de 2030.\",IF(O96=FALSE,\"Error: Falten dades per omplir d'esta acció.\",\"\")),IF(O96=FALSE,\"Error: Falten dades per omplir d'esta acció.\",\"\"))","v":""}]
[null,"Relació de l'acció amb les debilitats, amenaça, fortaleses o oportunitats del DAFO",null,null,null,null,"Fonts de finançament previstes"]
[]
[]
["Codi","Acció: Objectiu i resultats",null,null,null,"Prioritat","Pressupost","Any d'inici","Trimestre d'inici","Duració\nTrimestres"]
[{"$f":"CONCATENATE(\"A.\",K103)","v":"A.14"},null,null,null,null,null,null,null,null,null,{"$f":"K96+1","v":14},{"$f":"IFERROR(G103/J103,\"\")","v":""},{"$f":"MATCH(H103,'ETAPA III.b'!B$9:AO$9,0)+COLUMN('ETAPA III.b'!A$7)+RIGHT(I103,1)-1","v":{"$error":"#N/A"}},{"$f":"MATCH(H103,'ETAPA III.b'!B$9:AO$9,0)+COLUMN('ETAPA III.b'!A$7)+RIGHT(I103,1)-1+J103-1","v":{"$error":"#N/A"}},{"$f":"OR($I$4<K103,COUNTA(B103:J103,B105)=7)","v":true}]
[null,"DAFO",null,"Línies d'actuació"]
[null,null,null,{"$f":"_xlfn.TEXTJOIN(\", \",TRUE,IF(INDIRECT(CONCATENATE(\"'ETAPA III.a_'!\",SUBSTITUTE(ADDRESS(1,MATCH(A103,'ETAPA III.a_'!$5:$5,0),4),1,\"\"),\":\",SUBSTITUTE(ADDRESS(1,MATCH(A103,'ETAPA III.a_'!$5:$5,0),4),1,\"\")))=\"X\",'ETAPA III.a_'!A:A,\"\"))","v":""},null,null,null,null,null,{"$f":"IFERROR(IF(N103>41,\"Error: El final de esta acción sobrepasa el T4 de 2030.\",IF(O103=FALSE,\"Error: Falten dades per omplir d'esta acció.\",\"\")),IF(O103=FALSE,\"Error: Falten dades per omplir d'esta acció.\",\"\"))","v":""}]
[null,"Relació de l'acció amb les debilitats, amenaça, fortaleses o oportunitats del DAFO",null,null,null,null,"Fonts de finançament previstes"]
[]
[]
["Codi","Acció: Objectiu i resultats",null,null,null,"Prioritat","Pressupost","Any d'inici","Trimestre d'inici","Duració\nTrimestres"]
[{"$f":"CONCATENATE(\"A.\",K110)","v":"A.15"},null,null,null,null,null,null,null,null,null,{"$f":"K103+1","v":15},{"$f":"IFERROR(G110/J110,\"\")","v":""},{"$f":"MATCH(H110,'ETAPA III.b'!B$9:AO$9,0)+COLUMN('ETAPA III.b'!A$7)+RIGHT(I110,1)-1","v":{"$error":"#N/A"}},{"$f":"MATCH(H110,'ETAPA III.b'!B$9:AO$9,0)+COLUMN('ETAPA III.b'!A$7)+RIGHT(I110,1)-1+J110-1","v":{"$error":"#N/A"}},{"$f":"OR($I$4<K110,COUNTA(B110:J110,B112)=7)","v":true}]
[null,"DAFO",null,"Línies d'actuació"]
[null,null,null,{"$f":"_xlfn.TEXTJOIN(\", \",TRUE,IF(INDIRECT(CONCATENATE(\"'ETAPA III.a_'!\",SUBSTITUTE(ADDRESS(1,MATCH(A110,'ETAPA III.a_'!$5:$5,0),4),1,\"\"),\":\",SUBSTITUTE(ADDRESS(1,MATCH(A110,'ETAPA III.a_'!$5:$5,0),4),1,\"\")))=\"X\",'ETAPA III.a_'!A:A,\"\"))","v":""},null,null,null,null,null,{"$f":"IFERROR(IF(N110>41,\"Error: El final de esta acción sobrepasa el T4 de 2030.\",IF(O110=FALSE,\"Error: Falten dades per omplir d'esta acció.\",\"\")),IF(O110=FALSE,\"Error: Falten dades per omplir d'esta acció.\",\"\"))","v":""}]
[null,"Relació de l'acció amb les debilitats, amenaça, fortaleses o oportunitats del DAFO",null,null,null,null,"Fonts de finançament previstes"]
[]
[]
["Codi","Acció: Objectiu i resultats",null,null,null,"Prioritat","Pressupost","Any d'inici","Trimestre d'inici","Duració\nTrimestres"]
[{"$f":"CONCATENATE(\"A.\",K117)","v":"A.16"},null,null,null,null,null,null,null,null,null,{"$f":"K110+1","v":16},{"$f":"IFERROR(G117/J117,\"\")","v":""},{"$f":"MATCH(H117,'ETAPA III.b'!B$9:AO$9,0)+COLUMN('ETAPA III.b'!A$7)+RIGHT(I117,1)-1","v":{"$error":"#N/A"}},{"$f":"MATCH(H117,'ETAPA III.b'!B$9:AO$9,0)+COLUMN('ETAPA III.b'!A$7)+RIGHT(I117,1)-1+J117-1","v":{"$error":"#N/A"}},{"$f":"OR($I$4<K117,COUNTA(B117:J117,B119)=7)","v":true}]
[null,"DAFO",null,"Línies d'actuació"]
[null,null,null,{"$f":"_xlfn.TEXTJOIN(\", \",TRUE,IF(INDIRECT(CONCATENATE(\"'ETAPA III.a_'!\",SUBSTITUTE(ADDRESS(1,MATCH(A117,'ETAPA III.a_'!$5:$5,0),4),1,\"\"),\":\",SUBSTITUTE(ADDRESS(1,MATCH(A117,'ETAPA III.a_'!$5:$5,0),4),1,\"\")))=\"X\",'ETAPA III.a_'!A:A,\"\"))","v":""},null,null,null,null,null,{"$f":"IFERROR(IF(N117>41,\"Error: El final de esta acción sobrepasa el T4 de 2030.\",IF(O117=FALSE,\"Error: Falten dades per omplir d'esta acció.\",\"\")),IF(O117=FALSE,\"Error: Falten dades per omplir d'esta acció.\",\"\"))","v":""}]
[null,"Relació de l'acció amb les debilitats, amenaça, fortaleses o oportunitats del DAFO",null,null,null,null,"Fonts de finançament previstes"]
[]
[]
["Codi","Acció: Objectiu i resultats",null,null,null,"Prioritat","Pressupost","Any d'inici","Trimestre d'inici","Duració\nTrimestres"]
[{"$f":"CONCATENATE(\"A.\",K124)","v":"A.17"},null,null,null,null,null,null,null,null,null,{"$f":"K117+1","v":17},{"$f":"IFERROR(G124/J124,\"\")","v":""},{"$f":"MATCH(H124,'ETAPA III.b'!B$9:AO$9,0)+COLUMN('ETAPA III.b'!A$7)+RIGHT(I124,1)-1","v":{"$error":"#N/A"}},{"$f":"MATCH(H124,'ETAPA III.b'!B$9:AO$9,0)+COLUMN('ETAPA III.b'!A$7)+RIGHT(I124,1)-1+J124-1","v":{"$error":"#N/A"}},{"$f":"OR($I$4<K124,COUNTA(B124:J124,B126)=7)","v":true}]
[null,"DAFO",null,"Línies d'actuació"]
[null,null,null,{"$f":"_xlfn.TEXTJOIN(\", \",TRUE,IF(INDIRECT(CONCATENATE(\"'ETAPA III.a_'!\",SUBSTITUTE(ADDRESS(1,MATCH(A124,'ETAPA III.a_'!$5:$5,0),4),1,\"\"),\":\",SUBSTITUTE(ADDRESS(1,MATCH(A124,'ETAPA III.a_'!$5:$5,0),4),1,\"\")))=\"X\",'ETAPA III.a_'!A:A,\"\"))","v":""},null,null,null,null,null,{"$f":"IFERROR(IF(N124>41,\"Error: El final de esta acción sobrepasa el T4 de 2030.\",IF(O124=FALSE,\"Error: Falten dades per omplir d'esta acció.\",\"\")),IF(O124=FALSE,\"Error: Falten dades per omplir d'esta acció.\",\"\"))","v":""}]
[null,"Relació de l'acció amb les debilitats, amenaça, fortaleses o oportunitats del DAFO",null,null,null,null,"Fonts de finançament previstes"]
[]
[]
["Codi","Acció: Objectiu i resultats",null,null,null,"Prioritat","Pressupost","Any d'inici","Trimestre d'inici","Duració\nTrimestres"]
[{"$f":"CONCATENATE(\"A.\",K131)","v":"A.18"},null,null,null,null,null,null,null,null,null,{"$f":"K124+1","v":18},{"$f":"IFERROR(G131/J131,\"\")","v":""},{"$f":"MATCH(H131,'ETAPA III.b'!B$9:AO$9,0)+COLUMN('ETAPA III.b'!A$7)+RIGHT(I131,1)-1","v":{"$error":"#N/A"}},{"$f":"MATCH(H131,'ETAPA III.b'!B$9:AO$9,0)+COLUMN('ETAPA III.b'!A$7)+RIGHT(I131,1)-1+J131-1","v":{"$error":"#N/A"}},{"$f":"OR($I$4<K131,COUNTA(B131:J131,B133)=7)","v":true}]
[null,"DAFO",null,"Línies d'actuació"]
[null,null,null,{"$f":"_xlfn.TEXTJOIN(\", \",TRUE,IF(INDIRECT(CONCATENATE(\"'ETAPA III.a_'!\",SUBSTITUTE(ADDRESS(1,MATCH(A131,'ETAPA III.a_'!$5:$5,0),4),1,\"\"),\":\",SUBSTITUTE(ADDRESS(1,MATCH(A131,'ETAPA III.a_'!$5:$5,0),4),1,\"\")))=\"X\",'ETAPA III.a_'!A:A,\"\"))","v":""},null,null,null,null,null,{"$f":"IFERROR(IF(N131>41,\"Error: El final de esta acción sobrepasa el T4 de 2030.\",IF(O131=FALSE,\"Error: Falten dades per omplir d'esta acció.\",\"\")),IF(O131=FALSE,\"Error: Falten dades per omplir d'esta acció.\",\"\"))","v":""}]
[null,"Relació de l'acció amb les debilitats, amenaça, fortaleses o oportunitats del DAFO",null,null,null,null,"Fonts de finançament previstes"]
[]
[]
[{"$f":"TABLAS!$AL$2","v":"FITXES PER A L'ELABORACIÓ D'UNA ESTRATÈGIA LOCAL DE REHABILITACIÓ DE L'ENTORN CONSTRUÏT"}]
[null,null,null,null,null,null,null,null,null,{"$f":"IF($J$2=\"\",\"\",$J$2)","v":"ETAPA III: PROGRAMA D'ACTUACIONS"}]
[null,null,null,null,{"$f":"TABLAS!$AL$4","v":""}]
["Codi","Acció: Objectiu i resultats",null,null,null,"Prioritat","Pressupost","Any d'inici","Trimestre d'inici","Duració\nTrimestres"]
[{"$f":"CONCATENATE(\"A.\",K141)","v":"A.19"},null,null,null,null,null,null,null,null,null,{"$f":"K131+1","v":19},{"$f":"IFERROR(G141/J141,\"\")","v":""},{"$f":"MATCH(H141,'ETAPA III.b'!B$9:AO$9,0)+COLUMN('ETAPA III.b'!A$7)+RIGHT(I141,1)-1","v":{"$error":"#N/A"}},{"$f":"MATCH(H141,'ETAPA III.b'!B$9:AO$9,0)+COLUMN('ETAPA III.b'!A$7)+RIGHT(I141,1)-1+J141-1","v":{"$error":"#N/A"}},{"$f":"OR($I$4<K141,COUNTA(B141:J141,B143)=7)","v":true}]
[null,"DAFO",null,"Línies d'actuació"]
[null,null,null,{"$f":"_xlfn.TEXTJOIN(\", \",TRUE,IF(INDIRECT(CONCATENATE(\"'ETAPA III.a_'!\",SUBSTITUTE(ADDRESS(1,MATCH(A141,'ETAPA III.a_'!$5:$5,0),4),1,\"\"),\":\",SUBSTITUTE(ADDRESS(1,MATCH(A141,'ETAPA III.a_'!$5:$5,0),4),1,\"\")))=\"X\",'ETAPA III.a_'!A:A,\"\"))","v":""},null,null,null,null,null,{"$f":"IFERROR(IF(N141>41,\"Error: El final de esta acción sobrepasa el T4 de 2030.\",IF(O141=FALSE,\"Error: Falten dades per omplir d'esta acció.\",\"\")),IF(O141=FALSE,\"Error: Falten dades per omplir d'esta acció.\",\"\"))","v":""}]
[null,"Relació de l'acció amb les debilitats, amenaça, fortaleses o oportunitats del DAFO",null,null,null,null,"Fonts de finançament previstes"]
[]
[]
["Codi","Acció: Objectiu i resultats",null,null,null,"Prioritat","Pressupost","Any d'inici","Trimestre d'inici","Duració\nTrimestres"]
[{"$f":"CONCATENATE(\"A.\",K148)","v":"A.20"},null,null,null,null,null,null,null,null,null,{"$f":"K141+1","v":20},{"$f":"IFERROR(G148/J148,\"\")","v":""},{"$f":"MATCH(H148,'ETAPA III.b'!B$9:AO$9,0)+COLUMN('ETAPA III.b'!A$7)+RIGHT(I148,1)-1","v":{"$error":"#N/A"}},{"$f":"MATCH(H148,'ETAPA III.b'!B$9:AO$9,0)+COLUMN('ETAPA III.b'!A$7)+RIGHT(I148,1)-1+J148-1","v":{"$error":"#N/A"}},{"$f":"OR($I$4<K148,COUNTA(B148:J148,B150)=7)","v":true}]
[null,"DAFO",null,"Línies d'actuació"]
[null,null,null,{"$f":"_xlfn.TEXTJOIN(\", \",TRUE,IF(INDIRECT(CONCATENATE(\"'ETAPA III.a_'!\",SUBSTITUTE(ADDRESS(1,MATCH(A148,'ETAPA III.a_'!$5:$5,0),4),1,\"\"),\":\",SUBSTITUTE(ADDRESS(1,MATCH(A148,'ETAPA III.a_'!$5:$5,0),4),1,\"\")))=\"X\",'ETAPA III.a_'!A:A,\"\"))","v":""},null,null,null,null,null,{"$f":"IFERROR(IF(N148>41,\"Error: El final de esta acción sobrepasa el T4 de 2030.\",IF(O148=FALSE,\"Error: Falten dades per omplir d'esta acció.\",\"\")),IF(O148=FALSE,\"Error: Falten dades per omplir d'esta acció.\",\"\"))","v":""}]
[null,"Relació de l'acció amb les debilitats, amenaça, fortaleses o oportunitats del DAFO",null,null,null,null,"Fonts de finançament previstes"]
[]
[]
["Codi","Acció: Objectiu i resultats",null,null,null,"Prioritat","Pressupost","Any d'inici","Trimestre d'inici","Duració\nTrimestres"]
[{"$f":"CONCATENATE(\"A.\",K155)","v":"A.21"},null,null,null,null,null,null,null,null,null,{"$f":"K148+1","v":21},{"$f":"IFERROR(G155/J155,\"\")","v":""},{"$f":"MATCH(H155,'ETAPA III.b'!B$9:AO$9,0)+COLUMN('ETAPA III.b'!A$7)+RIGHT(I155,1)-1","v":{"$error":"#N/A"}},{"$f":"MATCH(H155,'ETAPA III.b'!B$9:AO$9,0)+COLUMN('ETAPA III.b'!A$7)+RIGHT(I155,1)-1+J155-1","v":{"$error":"#N/A"}},{"$f":"OR($I$4<K155,COUNTA(B155:J155,B157)=7)","v":true}]
[null,"DAFO",null,"Línies d'actuació"]
[null,null,null,{"$f":"_xlfn.TEXTJOIN(\", \",TRUE,IF(INDIRECT(CONCATENATE(\"'ETAPA III.a_'!\",SUBSTITUTE(ADDRESS(1,MATCH(A155,'ETAPA III.a_'!$5:$5,0),4),1,\"\"),\":\",SUBSTITUTE(ADDRESS(1,MATCH(A155,'ETAPA III.a_'!$5:$5,0),4),1,\"\")))=\"X\",'ETAPA III.a_'!A:A,\"\"))","v":""},null,null,null,null,null,{"$f":"IFERROR(IF(N155>41,\"Error: El final de esta acción sobrepasa el T4 de 2030.\",IF(O155=FALSE,\"Error: Falten dades per omplir d'esta acció.\",\"\")),IF(O155=FALSE,\"Error: Falten dades per omplir d'esta acció.\",\"\"))","v":""}]
[null,"Relació de l'acció amb les debilitats, amenaça, fortaleses o oportunitats del DAFO",null,null,null,null,"Fonts de finançament previstes"]
[]
[]
["Codi","Acció: Objectiu i resultats",null,null,null,"Prioritat","Pressupost","Any d'inici","Trimestre d'inici","Duració\nTrimestres"]
[{"$f":"CONCATENATE(\"A.\",K162)","v":"A.22"},null,null,null,null,null,null,null,null,null,{"$f":"K155+1","v":22},{"$f":"IFERROR(G162/J162,\"\")","v":""},{"$f":"MATCH(H162,'ETAPA III.b'!B$9:AO$9,0)+COLUMN('ETAPA III.b'!A$7)+RIGHT(I162,1)-1","v":{"$error":"#N/A"}},{"$f":"MATCH(H162,'ETAPA III.b'!B$9:AO$9,0)+COLUMN('ETAPA III.b'!A$7)+RIGHT(I162,1)-1+J162-1","v":{"$error":"#N/A"}},{"$f":"OR($I$4<K162,COUNTA(B162:J162,B164)=7)","v":true}]
[null,"DAFO",null,"Línies d'actuació"]
[null,null,null,{"$f":"_xlfn.TEXTJOIN(\", \",TRUE,IF(INDIRECT(CONCATENATE(\"'ETAPA III.a_'!\",SUBSTITUTE(ADDRESS(1,MATCH(A162,'ETAPA III.a_'!$5:$5,0),4),1,\"\"),\":\",SUBSTITUTE(ADDRESS(1,MATCH(A162,'ETAPA III.a_'!$5:$5,0),4),1,\"\")))=\"X\",'ETAPA III.a_'!A:A,\"\"))","v":""},null,null,null,null,null,{"$f":"IFERROR(IF(N162>41,\"Error: El final de esta acción sobrepasa el T4 de 2030.\",IF(O162=FALSE,\"Error: Falten dades per omplir d'esta acció.\",\"\")),IF(O162=FALSE,\"Error: Falten dades per omplir d'esta acció.\",\"\"))","v":""}]
[null,"Relació de l'acció amb les debilitats, amenaça, fortaleses o oportunitats del DAFO",null,null,null,null,"Fonts de finançament previstes"]
[]
[]
["Codi","Acció: Objectiu i resultats",null,null,null,"Prioritat","Pressupost","Any d'inici","Trimestre d'inici","Duració\nTrimestres"]
[{"$f":"CONCATENATE(\"A.\",K169)","v":"A.23"},null,null,null,null,null,null,null,null,null,{"$f":"K162+1","v":23},{"$f":"IFERROR(G169/J169,\"\")","v":""},{"$f":"MATCH(H169,'ETAPA III.b'!B$9:AO$9,0)+COLUMN('ETAPA III.b'!A$7)+RIGHT(I169,1)-1","v":{"$error":"#N/A"}},{"$f":"MATCH(H169,'ETAPA III.b'!B$9:AO$9,0)+COLUMN('ETAPA III.b'!A$7)+RIGHT(I169,1)-1+J169-1","v":{"$error":"#N/A"}},{"$f":"OR($I$4<K169,COUNTA(B169:J169,B171)=7)","v":true}]
[null,"DAFO",null,"Línies d'actuació"]
[null,null,null,{"$f":"_xlfn.TEXTJOIN(\", \",TRUE,IF(INDIRECT(CONCATENATE(\"'ETAPA III.a_'!\",SUBSTITUTE(ADDRESS(1,MATCH(A169,'ETAPA III.a_'!$5:$5,0),4),1,\"\"),\":\",SUBSTITUTE(ADDRESS(1,MATCH(A169,'ETAPA III.a_'!$5:$5,0),4),1,\"\")))=\"X\",'ETAPA III.a_'!A:A,\"\"))","v":""},null,null,null,null,null,{"$f":"IFERROR(IF(N169>41,\"Error: El final de esta acción sobrepasa el T4 de 2030.\",IF(O169=FALSE,\"Error: Falten dades per omplir d'esta acció.\",\"\")),IF(O169=FALSE,\"Error: Falten dades per omplir d'esta acció.\",\"\"))","v":""}]
[null,"Relació de l'acció amb les debilitats, amenaça, fortaleses o oportunitats del DAFO",null,null,null,null,"Fonts de finançament previstes"]
[]
[]
["Codi","Acció: Objectiu i resultats",null,null,null,"Prioritat","Pressupost","Any d'inici","Trimestre d'inici","Duració\nTrimestres"]
[{"$f":"CONCATENATE(\"A.\",K176)","v":"A.24"},null,null,null,null,null,null,null,null,null,{"$f":"K169+1","v":24},{"$f":"IFERROR(G176/J176,\"\")","v":""},{"$f":"MATCH(H176,'ETAPA III.b'!B$9:AO$9,0)+COLUMN('ETAPA III.b'!A$7)+RIGHT(I176,1)-1","v":{"$error":"#N/A"}},{"$f":"MATCH(H176,'ETAPA III.b'!B$9:AO$9,0)+COLUMN('ETAPA III.b'!A$7)+RIGHT(I176,1)-1+J176-1","v":{"$error":"#N/A"}},{"$f":"OR($I$4<K176,COUNTA(B176:J176,B178)=7)","v":true}]
[null,"DAFO",null,"Línies d'actuació"]
[null,null,null,{"$f":"_xlfn.TEXTJOIN(\", \",TRUE,IF(INDIRECT(CONCATENATE(\"'ETAPA III.a_'!\",SUBSTITUTE(ADDRESS(1,MATCH(A176,'ETAPA III.a_'!$5:$5,0),4),1,\"\"),\":\",SUBSTITUTE(ADDRESS(1,MATCH(A176,'ETAPA III.a_'!$5:$5,0),4),1,\"\")))=\"X\",'ETAPA III.a_'!A:A,\"\"))","v":""},null,null,null,null,null,{"$f":"IFERROR(IF(N176>41,\"Error: El final de esta acción sobrepasa el T4 de 2030.\",IF(O176=FALSE,\"Error: Falten dades per omplir d'esta acció.\",\"\")),IF(O176=FALSE,\"Error: Falten dades per omplir d'esta acció.\",\"\"))","v":""}]
[null,"Relació de l'acció amb les debilitats, amenaça, fortaleses o oportunitats del DAFO",null,null,null,null,"Fonts de finançament previstes"]
[]
[]
[{"$f":"TABLAS!$AL$2","v":"FITXES PER A L'ELABORACIÓ D'UNA ESTRATÈGIA LOCAL DE REHABILITACIÓ DE L'ENTORN CONSTRUÏT"}]
[null,null,null,null,null,null,null,null,null,{"$f":"IF($J$2=\"\",\"\",$J$2)","v":"ETAPA III: PROGRAMA D'ACTUACIONS"}]
[null,null,null,null,{"$f":"TABLAS!$AL$4","v":""}]
["Codi","Acció: Objectiu i resultats",null,null,null,"Prioritat","Pressupost","Any d'inici","Trimestre d'inici","Duració\nTrimestres"]
[{"$f":"CONCATENATE(\"A.\",K186)","v":"A.25"},null,null,null,null,null,null,null,null,null,{"$f":"K176+1","v":25},{"$f":"IFERROR(G186/J186,\"\")","v":""},{"$f":"MATCH(H186,'ETAPA III.b'!B$9:AO$9,0)+COLUMN('ETAPA III.b'!A$7)+RIGHT(I186,1)-1","v":{"$error":"#N/A"}},{"$f":"MATCH(H186,'ETAPA III.b'!B$9:AO$9,0)+COLUMN('ETAPA III.b'!A$7)+RIGHT(I186,1)-1+J186-1","v":{"$error":"#N/A"}},{"$f":"OR($I$4<K186,COUNTA(B186:J186,B188)=7)","v":true}]
[null,"DAFO",null,"Línies d'actuació"]
[null,null,null,{"$f":"_xlfn.TEXTJOIN(\", \",TRUE,IF(INDIRECT(CONCATENATE(\"'ETAPA III.a_'!\",SUBSTITUTE(ADDRESS(1,MATCH(A186,'ETAPA III.a_'!$5:$5,0),4),1,\"\"),\":\",SUBSTITUTE(ADDRESS(1,MATCH(A186,'ETAPA III.a_'!$5:$5,0),4),1,\"\")))=\"X\",'ETAPA III.a_'!A:A,\"\"))","v":""},null,null,null,null,null,{"$f":"IFERROR(IF(N186>41,\"Error: El final de esta acción sobrepasa el T4 de 2030.\",IF(O186=FALSE,\"Error: Falten dades per omplir d'esta acció.\",\"\")),IF(O186=FALSE,\"Error: Falten dades per omplir d'esta acció.\",\"\"))","v":""}]
[null,"Relació de l'acció amb les debilitats, amenaça, fortaleses o oportunitats del DAFO",null,null,null,null,"Fonts de finançament previstes"]
[]
[]
["Codi","Acció: Objectiu i resultats",null,null,null,"Prioritat","Pressupost","Any d'inici","Trimestre d'inici","Duració\nTrimestres"]
[{"$f":"CONCATENATE(\"A.\",K193)","v":"A.26"},null,null,null,null,null,null,null,null,null,{"$f":"K186+1","v":26},{"$f":"IFERROR(G193/J193,\"\")","v":""},{"$f":"MATCH(H193,'ETAPA III.b'!B$9:AO$9,0)+COLUMN('ETAPA III.b'!A$7)+RIGHT(I193,1)-1","v":{"$error":"#N/A"}},{"$f":"MATCH(H193,'ETAPA III.b'!B$9:AO$9,0)+COLUMN('ETAPA III.b'!A$7)+RIGHT(I193,1)-1+J193-1","v":{"$error":"#N/A"}},{"$f":"OR($I$4<K193,COUNTA(B193:J193,B195)=7)","v":true}]
[null,"DAFO",null,"Línies d'actuació"]
[null,null,null,{"$f":"_xlfn.TEXTJOIN(\", \",TRUE,IF(INDIRECT(CONCATENATE(\"'ETAPA III.a_'!\",SUBSTITUTE(ADDRESS(1,MATCH(A193,'ETAPA III.a_'!$5:$5,0),4),1,\"\"),\":\",SUBSTITUTE(ADDRESS(1,MATCH(A193,'ETAPA III.a_'!$5:$5,0),4),1,\"\")))=\"X\",'ETAPA III.a_'!A:A,\"\"))","v":""},null,null,null,null,null,{"$f":"IFERROR(IF(N193>41,\"Error: El final de esta acción sobrepasa el T4 de 2030.\",IF(O193=FALSE,\"Error: Falten dades per omplir d'esta acció.\",\"\")),IF(O193=FALSE,\"Error: Falten dades per omplir d'esta acció.\",\"\"))","v":""}]
[null,"Relació de l'acció amb les debilitats, amenaça, fortaleses o oportunitats del DAFO",null,null,null,null,"Fonts de finançament previstes"]
[]
[]
["Codi","Acció: Objectiu i resultats",null,null,null,"Prioritat","Pressupost","Any d'inici","Trimestre d'inici","Duració\nTrimestres"]
[{"$f":"CONCATENATE(\"A.\",K200)","v":"A.27"},null,null,null,null,null,null,null,null,null,{"$f":"K193+1","v":27},{"$f":"IFERROR(G200/J200,\"\")","v":""},{"$f":"MATCH(H200,'ETAPA III.b'!B$9:AO$9,0)+COLUMN('ETAPA III.b'!A$7)+RIGHT(I200,1)-1","v":{"$error":"#N/A"}},{"$f":"MATCH(H200,'ETAPA III.b'!B$9:AO$9,0)+COLUMN('ETAPA III.b'!A$7)+RIGHT(I200,1)-1+J200-1","v":{"$error":"#N/A"}},{"$f":"OR($I$4<K200,COUNTA(B200:J200,B202)=7)","v":true}]
[null,"DAFO",null,"Línies d'actuació"]
[null,null,null,{"$f":"_xlfn.TEXTJOIN(\", \",TRUE,IF(INDIRECT(CONCATENATE(\"'ETAPA III.a_'!\",SUBSTITUTE(ADDRESS(1,MATCH(A200,'ETAPA III.a_'!$5:$5,0),4),1,\"\"),\":\",SUBSTITUTE(ADDRESS(1,MATCH(A200,'ETAPA III.a_'!$5:$5,0),4),1,\"\")))=\"X\",'ETAPA III.a_'!A:A,\"\"))","v":""},null,null,null,null,null,{"$f":"IFERROR(IF(N200>41,\"Error: El final de esta acción sobrepasa el T4 de 2030.\",IF(O200=FALSE,\"Error: Falten dades per omplir d'esta acció.\",\"\")),IF(O200=FALSE,\"Error: Falten dades per omplir d'esta acció.\",\"\"))","v":""}]
[null,"Relació de l'acció amb les debilitats, amenaça, fortaleses o oportunitats del DAFO",null,null,null,null,"Fonts de finançament previstes"]
[]
[]
["Codi","Acció: Objectiu i resultats",null,null,null,"Prioritat","Pressupost","Any d'inici","Trimestre d'inici","Duració\nTrimestres"]
[{"$f":"CONCATENATE(\"A.\",K207)","v":"A.28"},null,null,null,null,null,null,null,null,null,{"$f":"K200+1","v":28},{"$f":"IFERROR(G207/J207,\"\")","v":""},{"$f":"MATCH(H207,'ETAPA III.b'!B$9:AO$9,0)+COLUMN('ETAPA III.b'!A$7)+RIGHT(I207,1)-1","v":{"$error":"#N/A"}},{"$f":"MATCH(H207,'ETAPA III.b'!B$9:AO$9,0)+COLUMN('ETAPA III.b'!A$7)+RIGHT(I207,1)-1+J207-1","v":{"$error":"#N/A"}},{"$f":"OR($I$4<K207,COUNTA(B207:J207,B209)=7)","v":true}]
[null,"DAFO",null,"Línies d'actuació"]
[null,null,null,{"$f":"_xlfn.TEXTJOIN(\", \",TRUE,IF(INDIRECT(CONCATENATE(\"'ETAPA III.a_'!\",SUBSTITUTE(ADDRESS(1,MATCH(A207,'ETAPA III.a_'!$5:$5,0),4),1,\"\"),\":\",SUBSTITUTE(ADDRESS(1,MATCH(A207,'ETAPA III.a_'!$5:$5,0),4),1,\"\")))=\"X\",'ETAPA III.a_'!A:A,\"\"))","v":""},null,null,null,null,null,{"$f":"IFERROR(IF(N207>41,\"Error: El final de esta acción sobrepasa el T4 de 2030.\",IF(O207=FALSE,\"Error: Falten dades per omplir d'esta acció.\",\"\")),IF(O207=FALSE,\"Error: Falten dades per omplir d'esta acció.\",\"\"))","v":""}]
[null,"Relació de l'acció amb les debilitats, amenaça, fortaleses o oportunitats del DAFO",null,null,null,null,"Fonts de finançament previstes"]
[]
[]
["Codi","Acció: Objectiu i resultats",null,null,null,"Prioritat","Pressupost","Any d'inici","Trimestre d'inici","Duració\nTrimestres"]
[{"$f":"CONCATENATE(\"A.\",K214)","v":"A.29"},null,null,null,null,null,null,null,null,null,{"$f":"K207+1","v":29},{"$f":"IFERROR(G214/J214,\"\")","v":""},{"$f":"MATCH(H214,'ETAPA III.b'!B$9:AO$9,0)+COLUMN('ETAPA III.b'!A$7)+RIGHT(I214,1)-1","v":{"$error":"#N/A"}},{"$f":"MATCH(H214,'ETAPA III.b'!B$9:AO$9,0)+COLUMN('ETAPA III.b'!A$7)+RIGHT(I214,1)-1+J214-1","v":{"$error":"#N/A"}},{"$f":"OR($I$4<K214,COUNTA(B214:J214,B216)=7)","v":true}]
[null,"DAFO",null,"Línies d'actuació"]
[null,null,null,{"$f":"_xlfn.TEXTJOIN(\", \",TRUE,IF(INDIRECT(CONCATENATE(\"'ETAPA III.a_'!\",SUBSTITUTE(ADDRESS(1,MATCH(A214,'ETAPA III.a_'!$5:$5,0),4),1,\"\"),\":\",SUBSTITUTE(ADDRESS(1,MATCH(A214,'ETAPA III.a_'!$5:$5,0),4),1,\"\")))=\"X\",'ETAPA III.a_'!A:A,\"\"))","v":""},null,null,null,null,null,{"$f":"IFERROR(IF(N214>41,\"Error: El final de esta acción sobrepasa el T4 de 2030.\",IF(O214=FALSE,\"Error: Falten dades per omplir d'esta acció.\",\"\")),IF(O214=FALSE,\"Error: Falten dades per omplir d'esta acció.\",\"\"))","v":""}]
[null,"Relació de l'acció amb les debilitats, amenaça, fortaleses o oportunitats del DAFO",null,null,null,null,"Fonts de finançament previstes"]
[]
[]
["Codi","Acció: Objectiu i resultats",null,null,null,"Prioritat","Pressupost","Any d'inici","Trimestre d'inici","Duració\nTrimestres"]
[{"$f":"CONCATENATE(\"A.\",K221)","v":"A.30"},null,null,null,null,null,null,null,null,null,{"$f":"K214+1","v":30},{"$f":"IFERROR(G221/J221,\"\")","v":""},{"$f":"MATCH(H221,'ETAPA III.b'!B$9:AO$9,0)+COLUMN('ETAPA III.b'!A$7)+RIGHT(I221,1)-1","v":{"$error":"#N/A"}},{"$f":"MATCH(H221,'ETAPA III.b'!B$9:AO$9,0)+COLUMN('ETAPA III.b'!A$7)+RIGHT(I221,1)-1+J221-1","v":{"$error":"#N/A"}},{"$f":"OR($I$4<K221,COUNTA(B221:J221,B223)=7)","v":true}]
[null,"DAFO",null,"Línies d'actuació"]
[null,null,null,{"$f":"_xlfn.TEXTJOIN(\", \",TRUE,IF(INDIRECT(CONCATENATE(\"'ETAPA III.a_'!\",SUBSTITUTE(ADDRESS(1,MATCH(A221,'ETAPA III.a_'!$5:$5,0),4),1,\"\"),\":\",SUBSTITUTE(ADDRESS(1,MATCH(A221,'ETAPA III.a_'!$5:$5,0),4),1,\"\")))=\"X\",'ETAPA III.a_'!A:A,\"\"))","v":""},null,null,null,null,null,{"$f":"IFERROR(IF(N221>41,\"Error: El final de esta acción sobrepasa el T4 de 2030.\",IF(O221=FALSE,\"Error: Falten dades per omplir d'esta acció.\",\"\")),IF(O221=FALSE,\"Error: Falten dades per omplir d'esta acció.\",\"\"))","v":""}]
[null,"Relació de l'acció amb les debilitats, amenaça, fortaleses o oportunitats del DAFO",null,null,null,null,"Fonts de finançament previstes"]

{"sheet":"ETAPA III.a_","index":9,"n_rows":381,"n_cols":32,"rows_kept":381,"cut":false,"hidden":false,"merged":[[279,11,281,11],[279,12,281,12],[326,29,328,29],[326,30,328,30],[326,31,328,31],[326,20,328,20],[326,21,328,21],[326,22,328,22],[326,23,328,23],[326,24,328,24],[326,25,328,25],[326,26,328,26],[326,27,328,27],[326,28,328,28],[279,24,281,24],[279,25,281,25],[279,13,281,13],[279,14,281,14],[279,20,281,20],[279,21,281,21],[279,22,281,22],[279,23,281,23],[303,27,305,27],[303,28,305,28],[279,2,281,2],[279,3,281,3],[279,17,281,17],[279,18,281,18],[279,19,281,19],[326,4,328,4],[326,5,328,5],[326,6,328,6],[326,7,328,7],[326,8,328,8],[326,9,328,9],[326,10,328,10],[326,11,328,11],[326,12,328,12],[326,13,328,13],[326,14,328,14],[326,15,328,15],[326,16,328,16],[326,17,328,17],[326,18,328,18],[326,19,328,19],[279,6,281,6],[279,7,281,7],[279,8,281,8],[242,31,244,31],[303,2,305,2],[303,3,305,3],[303,4,305,4],[303,5,305,5],[303,6,305,6],[303,7,305,7],[303,8,305,8],[303,9,305,9],[303,10,305,10],[303,11,305,11],[303,12,305,12],[303,13,305,13],[303,14,305,14],[303,15,305,15],[303,16,305,16],[303,17,305,17],[303,18,305,18],[279,15,281,15],[279,16,281,16],[279,9,281,9],[279,10,281,10],[279,4,281,4],[279,5,281,5],[242,23,244,23],[242,24,244,24],[242,25,244,25],[242,26,244,26],[246,7,247,7],[246,8,247,8],[246,9,247,9],[246,10,247,10],[246,11,247,11],[242,11,244,11],[242,12,244,12],[242,13,244,13],[242,14,244,14],[242,15,244,15],[242,16,244,16],[242,27,244,27],[242,28,244,28],[242,29,244,29],[242,30,244,30],[178,8,179,8],[178,9,179,9],[178,10,179,10],[178,11,179,11],[178,12,179,12],[242,18,244,18],[242,19,244,19],[242,20,244,20],[242,21,244,21],[204,9,206,9],[204,10,206,10],[204,11,206,11],[204,12,206,12],[204,13,206,13],[204,14,206,14],[204,15,206,15],[204,16,206,16],[204,17,206,17],[208,10,209,10],[208,11,209,11],[128,27,130,27],[128,28,130,28],[128,29,130,29],[128,30,130,30],[128,31,130,31],[174,2,176,2],[174,3,176,3],[174,4,176,4],[174,5,176,5],[174,6,176,6],[174,7,176,7],[174,8,176,8],[174,9,176,9],[174,10,176,10],[174,11,176,11],[174,12,176,12],[174,13,176,13],[174,14,176,14],[174,15,176,15],[174,16,176,16],[174,17,176,17],[174,18,176,18],[174,19,176,19],[174,20,176,20],[93,30,95,30],[93,31,95,31],[128,2,130,2],[128,3,130,3],[128,4,130,4],[128,5,130,5],[128,6,130,6],[128,7,130,7],[128,8,130,8],[128,9,130,9],[128,10,130,10],[128,11,130,11],[128,12,130,12],[128,13,130,13],[128,14,130,14],[128,15,130,15],[128,16,130,16],[128,17,130,17],[128,21,130,21],[128,22,130,22],[128,23,130,23],[128,24,130,24],[128,25,130,25],[128,26,130,26],[93,20,95,20],[93,21,95,21],[93,22,95,22],[93,24,95,24],[93,25,95,25],[93,26,95,26],[93,27,95,27],[93,28,95,28],[93,29,95,29],[25,26,27,26],[25,27,27,27],[25,28,27,28],[25,29,27,29],[25,30,27,30],[25,31,27,31],[93,2,95,2],[93,3,95,3],[93,4,95,4],[93,5,95,5],[93,6,95,6],[93,7,95,7],[93,8,95,8],[93,9,95,9],[93,10,95,10],[93,11,95,11],[93,12,95,12],[93,13,95,13],[93,14,95,14],[93,15,95,15],[93,16,95,16],[93,17,95,17],[93,18,95,18],[93,19,95,19],[25,2,27,2],[25,3,27,3],[25,4,27,4],[25,5,27,5],[25,6,27,6],[25,7,27,7],[25,8,27,8],[25,9,27,9],[25,10,27,10],[3,0,3,1],[4,2,5,2],[4,3,5,3],[4,4,5,4],[4,5,5,5],[4,6,5,6],[4,20,5,20],[4,21,5,21],[4,30,5,30],[4,24,5,24],[4,25,5,25],[4,26,5,26],[4,27,5,27],[4,28,5,28],[4,29,5,29],[4,7,5,7],[4,8,5,8],[4,9,5,9],[4,23,5,23],[4,22,5,22],[4,19,5,19],[4,11,5,11],[4,12,5,12],[4,13,5,13],[28,0,28,1],[29,2,30,2],[29,3,30,3],[29,4,30,4],[29,5,30,5],[29,6,30,6],[29,7,30,7],[29,8,30,8],[29,9,30,9],[4,14,5,14],[4,15,5,15],[4,10,5,10],[4,16,5,16],[4,17,5,17],[4,18,5,18],[29,27,30,27],[29,28,30,28],[29,29,30,29],[25,11,27,11],[25,12,27,12],[25,13,27,13],[25,14,27,14],[25,15,27,15],[25,16,27,16],[25,17,27,17],[25,18,27,18],[25,19,27,19],[25,20,27,20],[25,21,27,21],[25,22,27,22],[25,23,27,23],[25,24,27,24],[25,25,27,25],[29,30,30,30],[29,31,30,31],[29,22,30,22],[29,10,30,10],[29,11,30,11],[29,15,30,15],[29,16,30,16],[29,23,30,23],[29,24,30,24],[4,31,5,31],[96,0,96,1],[97,2,98,2],[97,3,98,3],[97,4,98,4],[97,5,98,5],[97,6,98,6],[29,25,30,25],[29,26,30,26],[29,17,30,17],[29,18,30,18],[29,19,30,19],[29,20,30,20],[29,21,30,21],[97,7,98,7],[97,8,98,8],[97,9,98,9],[97,10,98,10],[97,11,98,11],[97,12,98,12],[29,12,30,12],[29,13,30,13],[29,14,30,14],[93,23,95,23],[97,16,98,16],[97,17,98,17],[97,18,98,18],[97,13,98,13],[97,14,98,14],[97,15,98,15],[97,31,98,31],[97,26,98,26],[97,27,98,27],[97,29,98,29],[97,30,98,30],[97,21,98,21],[97,22,98,22],[97,28,98,28],[97,19,98,19],[97,20,98,20],[97,23,98,23],[97,24,98,24],[97,25,98,25],[128,18,130,18],[128,19,130,19],[128,20,130,20],[132,25,133,25],[132,26,133,26],[132,17,133,17],[132,18,133,18],[132,19,133,19],[132,20,133,20],[132,21,133,21],[132,22,133,22],[131,0,131,1],[132,9,133,9],[132,10,133,10],[132,11,133,11],[132,2,133,2],[132,3,133,3],[132,4,133,4],[132,5,133,5],[132,6,133,6],[132,7,133,7],[132,8,133,8],[174,23,176,23],[132,29,133,29],[132,30,133,30],[132,31,133,31],[174,24,176,24],[174,25,176,25],[174,26,176,26],[174,27,176,27],[174,28,176,28],[174,29,176,29],[174,30,176,30],[174,31,176,31],[132,23,133,23],[132,24,133,24],[132,27,133,27],[132,28,133,28],[132,16,133,16],[132,15,133,15],[132,12,133,12],[132,13,133,13],[132,14,133,14],[207,0,207,1],[208,2,209,2],[208,3,209,3],[208,4,209,4],[208,5,209,5],[208,6,209,6],[208,7,209,7],[177,0,177,1],[204,2,206,2],[204,3,206,3],[204,4,206,4],[204,5,206,5],[204,6,206,6],[204,7,206,7],[204,8,206,8],[178,2,179,2],[178,3,179,3],[178,4,179,4],[174,21,176,21],[174,22,176,22],[178,5,179,5],[178,6,179,6],[178,7,179,7],[178,19,179,19],[178,20,179,20],[178,21,179,21],[178,22,179,22],[208,31,209,31],[208,23,209,23],[208,24,209,24],[178,25,179,25],[204,31,206,31],[208,27,209,27],[208,28,209,28],[208,29,209,29],[208,30,209,30],[204,23,206,23],[204,24,206,24],[178,24,179,24],[208,25,209,25],[208,26,209,26],[204,22,206,22],[178,13,179,13],[204,18,206,18],[204,19,206,19],[178,31,179,31],[178,26,179,26],[178,27,179,27],[178,28,179,28],[178,29,179,29],[178,30,179,30],[204,21,206,21],[204,25,206,25],[204,26,206,26],[204,27,206,27],[204,28,206,28],[204,29,206,29],[204,30,206,30],[178,23,179,23],[204,20,206,20],[178,16,179,16],[178,17,179,17],[178,18,179,18],[178,14,179,14],[178,15,179,15],[242,2,244,2],[242,3,244,3],[242,4,244,4],[242,5,244,5],[242,6,244,6],[242,7,244,7],[242,8,244,8],[242,9,244,9],[242,10,244,10],[208,20,209,20],[208,21,209,21],[208,22,209,22],[208,8,209,8],[208,9,209,9],[242,17,244,17],[208,12,209,12],[246,21,247,21],[246,12,247,12],[246,13,247,13],[246,14,247,14],[246,15,247,15],[246,16,247,16],[208,13,209,13],[208,14,209,14],[246,17,247,17],[246,18,247,18],[246,19,247,19],[208,17,209,17],[208,18,209,18],[208,19,209,19],[208,15,209,15],[208,16,209,16],[242,22,244,22],[246,27,247,27],[246,28,247,28],[245,0,245,1],[246,29,247,29],[246,30,247,30],[246,31,247,31],[246,22,247,22],[246,23,247,23],[246,24,247,24],[246,25,247,25],[246,26,247,26],[246,20,247,20],[246,2,247,2],[246,3,247,3],[246,4,247,4],[246,5,247,5],[246,6,247,6],[283,8,284,8],[283,9,284,9],[283,10,284,10],[283,11,284,11],[283,12,284,12],[283,13,284,13],[283,29,284,29],[283,30,284,30],[283,31,284,31],[282,0,282,1],[283,2,284,2],[283,3,284,3],[283,4,284,4],[283,5,284,5],[283,6,284,6],[283,7,284,7],[303,24,305,24],[303,25,305,25],[283,24,284,24],[283,25,284,25],[283,19,284,19],[283,20,284,20],[283,21,284,21],[283,22,284,22],[283,23,284,23],[283,14,284,14],[283,15,284,15],[283,16,284,16],[283,17,284,17],[283,18,284,18],[303,20,305,20],[303,21,305,21],[303,22,305,22],[303,29,305,29],[303,30,305,30],[303,31,305,31],[279,26,281,26],[279,27,281,27],[279,28,281,28],[279,29,281,29],[279,30,281,30],[279,31,281,31],[283,26,284,26],[283,27,284,27],[283,28,284,28],[303,26,305,26],[303,23,305,23],[306,0,306,1],[307,2,308,2],[307,3,308,3],[307,4,308,4],[307,5,308,5],[307,6,308,6],[307,7,308,7],[307,8,308,8],[307,9,308,9],[303,19,305,19],[329,0,329,1],[307,26,308,26],[307,27,308,27],[307,28,308,28],[307,29,308,29],[307,30,308,30],[307,10,308,10],[307,11,308,11],[307,12,308,12],[307,13,308,13],[307,14,308,14],[307,15,308,15],[307,21,308,21],[307,22,308,22],[307,23,308,23],[307,24,308,24],[307,25,308,25],[307,16,308,16],[307,17,308,17],[307,18,308,18],[307,19,308,19],[307,20,308,20],[326,2,328,2],[326,3,328,3],[307,31,308,31],[330,7,331,7],[330,8,331,8],[330,9,331,9],[330,10,331,10],[330,11,331,11],[330,2,331,2],[330,3,331,3],[330,4,331,4],[330,5,331,5],[330,6,331,6],[330,17,331,17],[330,18,331,18],[330,19,331,19],[330,20,331,20],[330,21,331,21],[330,12,331,12],[330,13,331,13],[330,14,331,14],[330,15,331,15],[330,16,331,16],[330,27,331,27],[330,28,331,28],[330,29,331,29],[330,30,331,30],[330,31,331,31],[330,22,331,22],[330,23,331,23],[330,24,331,24],[330,25,331,25],[330,26,331,26],[0,5,2,5],[0,2,2,2],[0,3,2,3],[0,4,2,4],[0,6,2,6],[0,7,2,7],[0,8,2,8],[0,9,2,9],[0,10,2,10],[0,11,2,11],[0,12,2,12],[0,13,2,13],[0,14,2,14],[0,15,2,15],[0,16,2,16],[0,17,2,17],[0,18,2,18],[0,19,2,19],[0,29,2,29],[0,30,2,30],[0,31,2,31],[0,20,2,20],[0,21,2,21],[0,22,2,22],[0,23,2,23],[0,24,2,24],[0,25,2,25],[0,26,2,26],[0,27,2,27],[0,28,2,28]]}
[null,{"$f":"TABLAS!$AL$2","v":"FITXES PER A L'ELABORACIÓ D'UNA ESTRATÈGIA LOCAL DE REHABILITACIÓ DE L'ENTORN CONSTRUÏT"},{"$f":"IF(OR('ETAPA III.a'!$I$4<COLUMN(C$1)-COLUMN($B$1),COUNTIF(C5:C24,\"X\")+COUNTIF(C30:C92,\"X\")+COUNTIF(C98:C127,\"X\")+COUNTIF(C133:C173,\"X\")+COUNTIF(C179:C203,\"X\")+COUNTIF(C209:C241,\"X\")+COUNTIF(C247:C277,\"X\")+COUNTIF(C284:C302,\"X\")+COUNTIF(C308:C325,\"X\")+COUNTIF(C331:C381,\"X\")>0)=FALSE,\"Error: sense assignar.\",\"\")","v":"Error: sense assignar."},{"$f":"IF(OR('ETAPA III.a'!$I$4<COLUMN(D$1)-COLUMN($B$1),COUNTIF(D5:D24,\"X\")+COUNTIF(D30:D92,\"X\")+COUNTIF(D98:D127,\"X\")+COUNTIF(D133:D173,\"X\")+COUNTIF(D179:D203,\"X\")+COUNTIF(D209:D241,\"X\")+COUNTIF(D247:D277,\"X\")+COUNTIF(D284:D302,\"X\")+COUNTIF(D308:D325,\"X\")+COUNTIF(D331:D381,\"X\")>0)=FALSE,\"Error: sense assignar.\",\"\")","v":"Error: sense assignar."},{"$f":"IF(OR('ETAPA III.a'!$I$4<COLUMN(E$1)-COLUMN($B$1),COUNTIF(E5:E24,\"X\")+COUNTIF(E30:E92,\"X\")+COUNTIF(E98:E127,\"X\")+COUNTIF(E133:E173,\"X\")+COUNTIF(E179:E203,\"X\")+COUNTIF(E209:E241,\"X\")+COUNTIF(E247:E277,\"X\")+COUNTIF(E284:E302,\"X\")+COUNTIF(E308:E325,\"X\")+COUNTIF(E331:E381,\"X\")>0)=FALSE,\"Error: sense assignar.\",\"\")","v":"Error: sense assignar."},{"$f":"IF(OR('ETAPA III.a'!$I$4<COLUMN(F$1)-COLUMN($B$1),COUNTIF(F5:F24,\"X\")+COUNTIF(F30:F92,\"X\")+COUNTIF(F98:F127,\"X\")+COUNTIF(F133:F173,\"X\")+COUNTIF(F179:F203,\"X\")+COUNTIF(F209:F241,\"X\")+COUNTIF(F247:F277,\"X\")+COUNTIF(F284:F302,\"X\")+COUNTIF(F308:F325,\"X\")+COUNTIF(F331:F381,\"X\")>0)=FALSE,\"Error: sense assignar.\",\"\")","v":"Error: sense assignar."},{"$f":"IF(OR('ETAPA III.a'!$I$4<COLUMN(G$1)-COLUMN($B$1),COUNTIF(G5:G24,\"X\")+COUNTIF(G30:G92,\"X\")+COUNTIF(G98:G127,\"X\")+COUNTIF(G133:G173,\"X\")+COUNTIF(G179:G203,\"X\")+COUNTIF(G209:G241,\"X\")+COUNTIF(G247:G277,\"X\")+COUNTIF(G284:G302,\"X\")+COUNTIF(G308:G325,\"X\")+COUNTIF(G331:G381,\"X\")>0)=FALSE,\"Error: sense assignar.\",\"\")","v":"Error: sense assignar."},{"$f":"IF(OR('ETAPA III.a'!$I$4<COLUMN(H$1)-COLUMN($B$1),COUNTIF(H5:H24,\"X\")+COUNTIF(H30:H92,\"X\")+COUNTIF(H98:H127,\"X\")+COUNTIF(H133:H173,\"X\")+COUNTIF(H179:H203,\"X\")+COUNTIF(H209:H241,\"X\")+COUNTIF(H247:H277,\"X\")+COUNTIF(H284:H302,\"X\")+COUNTIF(H308:H325,\"X\")+COUNTIF(H331:H381,\"X\")>0)=FALSE,\"Error: sense assignar.\",\"\")","v":"Error: sense assignar."},{"$f":"IF(OR('ETAPA III.a'!$I$4<COLUMN(I$1)-COLUMN($B$1),COUNTIF(I5:I24,\"X\")+COUNTIF(I30:I92,\"X\")+COUNTIF(I98:I127,\"X\")+COUNTIF(I133:I173,\"X\")+COUNTIF(I179:I203,\"X\")+COUNTIF(I209:I241,\"X\")+COUNTIF(I247:I277,\"X\")+COUNTIF(I284:I302,\"X\")+COUNTIF(I308:I325,\"X\")+COUNTIF(I331:I381,\"X\")>0)=FALSE,\"Error: sense assignar.\",\"\")","v":""},{"$f":"IF(OR('ETAPA III.a'!$I$4<COLUMN(J$1)-COLUMN($B$1),COUNTIF(J5:J24,\"X\")+COUNTIF(J30:J92,\"X\")+COUNTIF(J98:J127,\"X\")+COUNTIF(J133:J173,\"X\")+COUNTIF(J179:J203,\"X\")+COUNTIF(J209:J241,\"X\")+COUNTIF(J247:J277,\"X\")+COUNTIF(J284:J302,\"X\")+COUNTIF(J308:J325,\"X\")+COUNTIF(J331:J381,\"X\")>0)=FALSE,\"Error: sense assignar.\",\"\")","v":""},{"$f":"IF(OR('ETAPA III.a'!$I$4<COLUMN(K$1)-COLUMN($B$1),COUNTIF(K5:K24,\"X\")+COUNTIF(K30:K92,\"X\")+COUNTIF(K98:K127,\"X\")+COUNTIF(K133:K173,\"X\")+COUNTIF(K179:K203,\"X\")+COUNTIF(K209:K241,\"X\")+COUNTIF(K247:K277,\"X\")+COUNTIF(K284:K302,\"X\")+COUNTIF(K308:K325,\"X\")+COUNTIF(K331:K381,\"X\")>0)=FALSE,\"Error: sense assignar.\",\"\")","v":""},{"$f":"IF(OR('ETAPA III.a'!$I$4<COLUMN(L$1)-COLUMN($B$1),COUNTIF(L5:L24,\"X\")+COUNTIF(L30:L92,\"X\")+COUNTIF(L98:L127,\"X\")+COUNTIF(L133:L173,\"X\")+COUNTIF(L179:L203,\"X\")+COUNTIF(L209:L241,\"X\")+COUNTIF(L247:L277,\"X\")+COUNTIF(L284:L302,\"X\")+COUNTIF(L308:L325,\"X\")+COUNTIF(L331:L381,\"X\")>0)=FALSE,\"Error: sense assignar.\",\"\")","v":""},{"$f":"IF(OR('ETAPA III.a'!$I$4<COLUMN(M$1)-COLUMN($B$1),COUNTIF(M5:M24,\"X\")+COUNTIF(M30:M92,\"X\")+COUNTIF(M98:M127,\"X\")+COUNTIF(M133:M173,\"X\")+COUNTIF(M179:M203,\"X\")+COUNTIF(M209:M241,\"X\")+COUNTIF(M247:M277,\"X\")+COUNTIF(M284:M302,\"X\")+COUNTIF(M308:M325,\"X\")+COUNTIF(M331:M381,\"X\")>0)=FALSE,\"Error: sense assignar.\",\"\")","v":""},{"$f":"IF(OR('ETAPA III.a'!$I$4<COLUMN(N$1)-COLUMN($B$1),COUNTIF(N5:N24,\"X\")+COUNTIF(N30:N92,\"X\")+COUNTIF(N98:N127,\"X\")+COUNTIF(N133:N173,\"X\")+COUNTIF(N179:N203,\"X\")+COUNTIF(N209:N241,\"X\")+COUNTIF(N247:N277,\"X\")+COUNTIF(N284:N302,\"X\")+COUNTIF(N308:N325,\"X\")+COUNTIF(N331:N381,\"X\")>0)=FALSE,\"Error: sense assignar.\",\"\")","v":""},{"$f":"IF(OR('ETAPA III.a'!$I$4<COLUMN(O$1)-COLUMN($B$1),COUNTIF(O5:O24,\"X\")+COUNTIF(O30:O92,\"X\")+COUNTIF(O98:O127,\"X\")+COUNTIF(O133:O173,\"X\")+COUNTIF(O179:O203,\"X\")+COUNTIF(O209:O241,\"X\")+COUNTIF(O247:O277,\"X\")+COUNTIF(O284:O302,\"X\")+COUNTIF(O308:O325,\"X\")+COUNTIF(O331:O381,\"X\")>0)=FALSE,\"Error: sense assignar.\",\"\")","v":""},{"$f":"IF(OR('ETAPA III.a'!$I$4<COLUMN(P$1)-COLUMN($B$1),COUNTIF(P5:P24,\"X\")+COUNTIF(P30:P92,\"X\")+COUNTIF(P98:P127,\"X\")+COUNTIF(P133:P173,\"X\")+COUNTIF(P179:P203,\"X\")+COUNTIF(P209:P241,\"X\")+COUNTIF(P247:P277,\"X\")+COUNTIF(P284:P302,\"X\")+COUNTIF(P308:P325,\"X\")+COUNTIF(P331:P381,\"X\")>0)=FALSE,\"Error: sense assignar.\",\"\")","v":""},{"$f":"IF(OR('ETAPA III.a'!$I$4<COLUMN(Q$1)-COLUMN($B$1),COUNTIF(Q5:Q24,\"X\")+COUNTIF(Q30:Q92,\"X\")+COUNTIF(Q98:Q127,\"X\")+COUNTIF(Q133:Q173,\"X\")+COUNTIF(Q179:Q203,\"X\")+COUNTIF(Q209:Q241,\"X\")+COUNTIF(Q247:Q277,\"X\")+COUNTIF(Q284:Q302,\"X\")+COUNTIF(Q308:Q325,\"X\")+COUNTIF(Q331:Q381,\"X\")>0)=FALSE,\"Error: sense assignar.\",\"\")","v":""},{"$f":"IF(OR('ETAPA III.a'!$I$4<COLUMN(R$1)-COLUMN($B$1),COUNTIF(R5:R24,\"X\")+COUNTIF(R30:R92,\"X\")+COUNTIF(R98:R127,\"X\")+COUNTIF(R133:R173,\"X\")+COUNTIF(R179:R203,\"X\")+COUNTIF(R209:R241,\"X\")+COUNTIF(R247:R277,\"X\")+COUNTIF(R284:R302,\"X\")+COUNTIF(R308:R325,\"X\")+COUNTIF(R331:R381,\"X\")>0)=FALSE,\"Error: sense assignar.\",\"\")","v":""},{"$f":"IF(OR('ETAPA III.a'!$I$4<COLUMN(S$1)-COLUMN($B$1),COUNTIF(S5:S24,\"X\")+COUNTIF(S30:S92,\"X\")+COUNTIF(S98:S127,\"X\")+COUNTIF(S133:S173,\"X\")+COUNTIF(S179:S203,\"X\")+COUNTIF(S209:S241,\"X\")+COUNTIF(S247:S277,\"X\")+COUNTIF(S284:S302,\"X\")+COUNTIF(S308:S325,\"X\")+COUNTIF(S331:S381,\"X\")>0)=FALSE,\"Error: sense assignar.\",\"\")","v":""},{"$f":"IF(OR('ETAPA III.a'!$I$4<COLUMN(T$1)-COLUMN($B$1),COUNTIF(T5:T24,\"X\")+COUNTIF(T30:T92,\"X\")+COUNTIF(T98:T127,\"X\")+COUNTIF(T133:T173,\"X\")+COUNTIF(T179:T203,\"X\")+COUNTIF(T209:T241,\"X\")+COUNTIF(T247:T277,\"X\")+COUNTIF(T284:T302,\"X\")+COUNTIF(T308:T325,\"X\")+COUNTIF(T331:T381,\"X\")>0)=FALSE,\"Error: sense assignar.\",\"\")","v":""},{"$f":"IF(OR('ETAPA III.a'!$I$4<COLUMN(U$1)-COLUMN($B$1),COUNTIF(U5:U24,\"X\")+COUNTIF(U30:U92,\"X\")+COUNTIF(U98:U127,\"X\")+COUNTIF(U133:U173,\"X\")+COUNTIF(U179:U203,\"X\")+COUNTIF(U209:U241,\"X\")+COUNTIF(U247:U277,\"X\")+COUNTIF(U284:U302,\"X\")+COUNTIF(U308:U325,\"X\")+COUNTIF(U331:U381,\"X\")>0)=FALSE,\"Error: sense assignar.\",\"\")","v":""},{"$f":"IF(OR('ETAPA III.a'!$I$4<COLUMN(V$1)-COLUMN($B$1),COUNTIF(V5:V24,\"X\")+COUNTIF(V30:V92,\"X\")+COUNTIF(V98:V127,\"X\")+COUNTIF(V133:V173,\"X\")+COUNTIF(V179:V203,\"X\")+COUNTIF(V209:V241,\"X\")+COUNTIF(V247:V277,\"X\")+COUNTIF(V284:V302,\"X\")+COUNTIF(V308:V325,\"X\")+COUNTIF(V331:V381,\"X\")>0)=FALSE,\"Error: sense assignar.\",\"\")","v":""},{"$f":"IF(OR('ETAPA III.a'!$I$4<COLUMN(W$1)-COLUMN($B$1),COUNTIF(W5:W24,\"X\")+COUNTIF(W30:W92,\"X\")+COUNTIF(W98:W127,\"X\")+COUNTIF(W133:W173,\"X\")+COUNTIF(W179:W203,\"X\")+COUNTIF(W209:W241,\"X\")+COUNTIF(W247:W277,\"X\")+COUNTIF(W284:W302,\"X\")+COUNTIF(W308:W325,\"X\")+COUNTIF(W331:W381,\"X\")>0)=FALSE,\"Error: sense assignar.\",\"\")","v":""},{"$f":"IF(OR('ETAPA III.a'!$I$4<COLUMN(X$1)-COLUMN($B$1),COUNTIF(X5:X24,\"X\")+COUNTIF(X30:X92,\"X\")+COUNTIF(X98:X127,\"X\")+COUNTIF(X133:X173,\"X\")+COUNTIF(X179:X203,\"X\")+COUNTIF(X209:X241,\"X\")+COUNTIF(X247:X277,\"X\")+COUNTIF(X284:X302,\"X\")+COUNTIF(X308:X325,\"X\")+COUNTIF(X331:X381,\"X\")>0)=FALSE,\"Error: sense assignar.\",\"\")","v":""},{"$f":"IF(OR('ETAPA III.a'!$I$4<COLUMN(Y$1)-COLUMN($B$1),COUNTIF(Y5:Y24,\"X\")+COUNTIF(Y30:Y92,\"X\")+COUNTIF(Y98:Y127,\"X\")+COUNTIF(Y133:Y173,\"X\")+COUNTIF(Y179:Y203,\"X\")+COUNTIF(Y209:Y241,\"X\")+COUNTIF(Y247:Y277,\"X\")+COUNTIF(Y284:Y302,\"X\")+COUNTIF(Y308:Y325,\"X\")+COUNTIF(Y331:Y381,\"X\")>0)=FALSE,\"Error: sense assignar.\",\"\")","v":""},{"$f":"IF(OR('ETAPA III.a'!$I$4<COLUMN(Z$1)-COLUMN($B$1),COUNTIF(Z5:Z24,\"X\")+COUNTIF(Z30:Z92,\"X\")+COUNTIF(Z98:Z127,\"X\")+COUNTIF(Z133:Z173,\"X\")+COUNTIF(Z179:Z203,\"X\")+COUNTIF(Z209:Z241,\"X\")+COUNTIF(Z247:Z277,\"X\")+COUNTIF(Z284:Z302,\"X\")+COUNTIF(Z308:Z325,\"X\")+COUNTIF(Z331:Z381,\"X\")>0)=FALSE,\"Error: sense assignar.\",\"\")","v":""},{"$f":"IF(OR('ETAPA III.a'!$I$4<COLUMN(AA$1)-COLUMN($B$1),COUNTIF(AA5:AA24,\"X\")+COUNTIF(AA30:AA92,\"X\")+COUNTIF(AA98:AA127,\"X\")+COUNTIF(AA133:AA173,\"X\")+COUNTIF(AA179:AA203,\"X\")+COUNTIF(AA209:AA241,\"X\")+COUNTIF(AA247:AA277,\"X\")+COUNTIF(AA284:AA302,\"X\")+COUNTIF(AA308:AA325,\"X\")+COUNTIF(AA331:AA381,\"X\")>0)=FALSE,\"Error: sense assignar.\",\"\")","v":""},{"$f":"IF(OR('ETAPA III.a'!$I$4<COLUMN(AB$1)-COLUMN($B$1),COUNTIF(AB5:AB24,\"X\")+COUNTIF(AB30:AB92,\"X\")+COUNTIF(AB98:AB127,\"X\")+COUNTIF(AB133:AB173,\"X\")+COUNTIF(AB179:AB203,\"X\")+COUNTIF(AB209:AB241,\"X\")+COUNTIF(AB247:AB277,\"X\")+COUNTIF(AB284:AB302,\"X\")+COUNTIF(AB308:AB325,\"X\")+COUNTIF(AB331:AB381,\"X\")>0)=FALSE,\"Error: sense assignar.\",\"\")","v":""},{"$f":"IF(OR('ETAPA III.a'!$I$4<COLUMN(AC$1)-COLUMN($B$1),COUNTIF(AC5:AC24,\"X\")+COUNTIF(AC30:AC92,\"X\")+COUNTIF(AC98:AC127,\"X\")+COUNTIF(AC133:AC173,\"X\")+COUNTIF(AC179:AC203,\"X\")+COUNTIF(AC209:AC241,\"X\")+COUNTIF(AC247:AC277,\"X\")+COUNTIF(AC284:AC302,\"X\")+COUNTIF(AC308:AC325,\"X\")+COUNTIF(AC331:AC381,\"X\")>0)=FALSE,\"Error: sense assignar.\",\"\")","v":""},{"$f":"IF(OR('ETAPA III.a'!$I$4<COLUMN(AD$1)-COLUMN($B$1),COUNTIF(AD5:AD24,\"X\")+COUNTIF(AD30:AD92,\"X\")+COUNTIF(AD98:AD127,\"X\")+COUNTIF(AD133:AD173,\"X\")+COUNTIF(AD179:AD203,\"X\")+COUNTIF(AD209:AD241,\"X\")+COUNTIF(AD247:AD277,\"X\")+COUNTIF(AD284:AD302,\"X\")+COUNTIF(AD308:AD325,\"X\")+COUNTIF(AD331:AD381,\"X\")>0)=FALSE,\"Error: sense assignar.\",\"\")","v":""},{"$f":"IF(OR('ETAPA III.a'!$I$4<COLUMN(AE$1)-COLUMN($B$1),COUNTIF(AE5:AE24,\"X\")+COUNTIF(AE30:AE92,\"X\")+COUNTIF(AE98:AE127,\"X\")+COUNTIF(AE133:AE173,\"X\")+COUNTIF(AE179:AE203,\"X\")+COUNTIF(AE209:AE241,\"X\")+COUNTIF(AE247:AE277,\"X\")+COUNTIF(AE284:AE302,\"X\")+COUNTIF(AE308:AE325,\"X\")+COUNTIF(AE331:AE381,\"X\")>0)=FALSE,\"Error: sense assignar.\",\"\")","v":""},{"$f":"IF(OR('ETAPA III.a'!$I$4<COLUMN(AF$1)-COLUMN($B$1),COUNTIF(AF5:AF24,\"X\")+COUNTIF(AF30:AF92,\"X\")+COUNTIF(AF98:AF127,\"X\")+COUNTIF(AF133:AF173,\"X\")+COUNTIF(AF179:AF203,\"X\")+COUNTIF(AF209:AF241,\"X\")+COUNTIF(AF247:AF277,\"X\")+COUNTIF(AF284:AF302,\"X\")+COUNTIF(AF308:AF325,\"X\")+COUNTIF(AF331:AF381,\"X\")>0)=FALSE,\"Error: sense assignar.\",\"\")","v":""}]
[null,{"$f":"TABLAS!$AL$6","v":"ETAPA III: PROGRAMA D'ACTUACIONS"}]
[null,{"$f":"TABLAS!$AL$4","v":""}]
["LÍNIES D'ACTUACIÓ",null,"ACCIONS"]
[1,"ORDENAR EL TERRITORI I FER UN ÚS RACIONAL DEL SÒL, CONSERVAR-LO I PROTEGIR-LO","A.1","A.2","A.3","A.4","A.5","A.6","A.7","A.8","A.9","A.10","A.11","A.12","A.13","A.14","A.15","A.16","A.17","A.18","A.19","A.20","A.21","A.22","A.23","A.24","A.25","A.26","A.27","A.28","A.29","A.30"]
["1.1","Ordenar el sòl de manera compatible amb el seu entorn territorial."]
["1.1.1","Disposar d'una estratègia o pla d'ordenació del territori que establisca les bases del model territorial. Poden ser estratègies regionals, subregionals i fins i tot sectorials, però han de tindre en comú la utilització racional del territori. "]
["1.1.2","Introduir mesures per a vincular l'ordenació territorial amb la planificació econòmica, cultural i dels recursos naturals, amb l'objectiu de limitar el despoblament i contribuir a la conservació de la naturalesa, la protecció dels usos rurals tradicionals i prestar una especial atenció als xicotets nuclis de població. El despoblament és fonamentalment un problema territorial i d'absència de visió estratègica i de desenvolupament supralocal."]
["1.1.3","Dissenyar la ciutat de conformitat amb el model territorial i de manera coordinada amb els nuclis adjacents, tenint en compte les característiques pròpies de clima, humitat, territori i paisatge. "]
["1.1.4","Reduir el consum de sòl verge per a adequar-lo a les dinàmiques de la població i a les noves activitats econòmiques, i fomentar la productivitat del sòl ja transformat. Això requereix l'elaboració de memòries realistes que no només responguen al tràmit formal d'incorporació d'aquest document a la resta de la documentació del corresponent pla urbanístic o territorial."]
["1.1.5","Impulsar la màxima interconnexió entre els àmbits rural i urbà, per a fomentar la seua interdependència mitjançant polítiques econòmiques, mediambientals, socials i de governança, amb mesures que afavorisquen les activitats forestals i agrícoles urbanes i periurbanes ordenades, així com les ramaderes, i les polítiques de desenvolupament rural sostenible."]
["1.1.6","Potenciar la inclusió del patrimoni natural en els catàlegs municipals que formen part de la documentació del planejament. "]
["1.1.7","Posar en marxa mecanismes de coordinació i col·laboració que es basen en la utilització sostenible del territori, a les regions o ciutats amb relacions de veïnatge transfronterer o interregional."]
["1.2","Conservar i millorar el patrimoni natural i cultural i protegir el paisatge.","A1","A2","A3","A4","A5","A6","A7","A8","A9","A10","A11","A12","A13","A14","A15","A16","A17","A18","A19","A20","A21","A22","A23","A24","A25","A26","A27","A28","A29","A30"]
["1.2.1","Elaborar estratègies per a millorar, conservar i posar en valor el patrimoni cultural –tant els aspectes tangibles, com els intangibles (formes de vida, tradicions, etc.)– i el paisatge urbà i rural, amb la finalitat de desenvolupar tot el seu potencial i garantir un nivell adequat de conservació i manteniment."]
["1.2.2","Adoptar mesures de conservació, millora i protecció de la naturalesa i del patrimoni natural: flora, fauna, paisatge i ecosistemes existents. A tals efectes es proposa l'adopció de mesures dirigides a reduir l'ús d'herbicides químics, la millora dels hàbitats dels pol·linitzadors en les àrees urbanes i periurbanes, etc., així com aplicar metodologies i programes de seguiment de la biodiversitat urbana. "]
["1.2.3","Protegir el medi rural d'acord amb el caràcter, especialment el sòl rural fronterer, de vora o confrontant amb el sòl urbà."]
["1.2.4","Realitzar un aprofitament adequat  de les muntanyes des del punt de vista de la biomassa forestal amb finalitats energètiques, com a part d'una estratègia per a l'impuls del desenvolupament rural, la conservació dels usos tradicionals que afavorisquen la conservació dels espais naturals i la prevenció dels incendis."]
["1.2.5","Posar en marxa campanyes de difusió del patrimoni cultural i natural, per a aconseguir una autèntica cultura de pertinença basada en el coneixement, que se sume a la utilització racional d'aquest com a recurs econòmic i turístic. "]
["1.3","Millorar les infraestructures verdes i blaves i vincular-les amb el context natural.","A1","A2","A3","A4","A5","A6","A7","A8","A9","A10","A11","A12","A13","A14","A15","A16","A17","A18","A19","A20","A21","A22","A23","A24","A25","A26","A27","A28","A29","A30"]
["1.3.1","Incorporar a la planificació i a la gestió urbanística el concepte d'infraestructures verdes urbanes, com a solucions multifuncionals basades en la naturalesa, que permeten atendre els problemes urbans. No només contribueixen a millorar la biodiversitat, sinó que lluiten contra el canvi climàtic, tant en l'àmbit de la reducció de les emissions GEH, com en l'adaptació local. Finalment, contribueixen a l'oci i al gaudi ciutadà. Aquest tipus d'infraestructures són per tant, claus per a la comprensió i la gestió del metabolisme urbà."]
["1.3.2","Organitzar i dissenyar les xarxes d'infraestructures verdes i blaves tenint en compte criteris de connectivitat ecològica i de les característiques geomorfològiques del territori, amb l'objectiu d'optimitzar la prestació de serveis eco-sistèmics als ciutadans. Això implica, també, delimitar i identificar els elements que constitueixen aquestes infraestructures i establir mesures per a la seua restauració, conservació i gestió, a escala regional, local i de barri. "]
["1.3.3","Assignar els usos del sòl en coherència amb les característiques de la base territorial preexistent."]
["1.3.4","Aprofitar les vies pecuàries i incorporar-les amb criteris de connectivitat ecològica i com a fórmula per a combatre la fragmentació territorial."]
[]
[null,{"$f":"TABLAS!$AL$2","v":"FITXES PER A L'ELABORACIÓ D'UNA ESTRATÈGIA LOCAL DE REHABILITACIÓ DE L'ENTORN CONSTRUÏT"},{"$f":"IF(C$1=\"\",\"\",C$1)","v":"Error: sense assignar."},{"$f":"IF(D$1=\"\",\"\",D$1)","v":"Error: sense assignar."},"Error: sense assignar.","Error: sense assignar.","Error: sense assignar.","Error: sense assignar.","","","","","","","","","","","","","","","","","","","","","","","",""]
[null,{"$f":"IF($B$2=\"\",\"\",$B$2)","v":"ETAPA III: PROGRAMA D'ACTUACIONS"}]
[null,{"$f":"TABLAS!$AL$4","v":""}]
["LÍNIES D'ACTUACIÓ",null,"ACCIONS"]
[2,"EVITAR LA DISPERSIÓ URBANA I REVITALITZAR LA CIUTAT EXISTENT","A.1","A.2","A.3","A.4","A.5","A.6","A.7","A.8","A.9","A.10","A.11","A.12","A.13","A.14","A.15","A.16","A.17","A.18","A.19","A.20","A.21","A.22","A.23","A.24","A.25","A.26","A.27","A.28","A.29","A.30"]
["2,1","Definir un model urbà que fomente la compacitat, l'equilibri urbà i la dotació de serveis bàsics."]
["2.1.1","Adoptar mesures mitjançant el planejament territorial i urbanístic que asseguren un resultat equilibrat, afavorint els processos d'ocupació i de transformació del sòl, quan corresponguen, amb una densitat urbana adequada. "]
["2.1.2","Avaluar el cost de l'expansió urbana descontrolada, incloent-hi totes les conseqüències i externalitats negatives."]
["2.1.3","Incrementar la compacitat dels teixits urbans excessivament laxos, propis de les urbanitzacions de baixa densitat, per a propiciar, segons els casos, increments d'edificabilitat, de densitat o el reajustament de dotacions sobredimensionades. "]
["2.1.4","Dissenyar un sistema de dotacions i equipaments locals adequat i equilibrat, quantitativament i qualitativament, i tenint en compte el criteri de proximitat per a la localització, amb especial atenció a les zones verdes i als espais lliures de convivència. Estudiar la possibilitat de combinar usos dotacionals diferents en un sol equipament en temps diferents, per a afavorir la multifuncionalitat. "]
["2.1.5","Implementar mesures que permeten satisfer de manera autònoma a escala de barri i en la major mesura possible, les necessitats quotidianes de la població, i adequar l'oferta de serveis i equipaments."]
["2.1.6","No generalitzar els equipaments i l'absoluta identitat en tots els barris. Cal graduar els realment necessaris en cada barri per a evitar costos econòmics i mediambientals insostenibles."]
["2.1.7","Assegurar la prestació dels serveis públics que afavorisquen la conciliació familiar alhora que contribueixen a la igualtat de tracte i a la igualtat efectiva de dones i homes, com ara residències de majors, centres de dia, guarderies o campaments municipals. Tot això en el marc de les respectives competències."]
["2.1.8","Reurbanitzar zones industrials abandonades i reedificar i reutilitzar terrenys i edificis vacants i infrautilitzats, inclosa la identificació, amb mapes, dels immobles infrautilitzats."]
["2.1.9","Potenciar l'ús de l'espai públic per a la generació d'energies renovables, establint recomanacions, o fins i tot obligacions en funció de la superfície, per a aconseguir aquest objectiu (exemple: cobriment amb plaques fotovoltaiques dels espais destinats a aparcaments de vehicles en superfície en sòl urbà)."]
["2.1.10","Avaluar, mesurar i gestionar les ocupacions il·legals de sòls i edificis."]
["2.1.11","Posar en marxa mecanismes de coordinació i col·laboració interadministrativa per a millorar la prestació de serveis bàsics en els xicotets nuclis de població, sobretot en aquells que, d'acord amb la planificació territorial, responen a un model d'equilibri territorial reconegut (consorcis, mancomunitats, etc.)"]
["2.2","Garantir la complexitat funcional i diversitat d'usos. ","A1","A2","A3","A4","A5","A6","A7","A8","A9","A10","A11","A12","A13","A14","A15","A16","A17","A18","A19","A20","A21","A22","A23","A24","A25","A26","A27","A28","A29","A30"]
["2.2.1","Assegurar amb el planejament urbanístic una ocupació i ús del sòl eficient combinant els usos compatibles, principalment a escala de barri."]
["2.2.2","Connectar els teixits urbans mitjançant corredors continus d'activitat i buscar la mescla tipològica, funcional i social en la ciutat consolidada. "]
["2.2.3","Incentivar les activitats que afavoreixen la diversitat d'usos i reservar espai suficient per a activitats econòmiques i productives. "]
["2.2.4","Evitar la terciarització i la gentrificació de determinades àrees de la ciutat equilibrant els usos residencials amb els usos terciaris."]
["2.2.5","Afavorir la mescla d'usos en els edificis, flexibilitzant els plans urbanístics perquè puga respondre a una demanda real canviant. Cal tindre en compte que les decisions en la planificació territorial i urbana canvien els entorns, afecten els llocs en els quals es viu i es treballa, la manera de desplaçar-se, a què es dedica el temps d'oci, i són factors que determinen la salut de les persones, per la qual cosa és necessari analitzar-los i fer un seguiment, considerar l'equitat en els processos de planejament, la participació comunitària i el desenvolupament d'instruments que faciliten la seua visibilització des de les etapes més primerenques de la planificació. "]
["2.3","Millorar la qualitat i l'accessibilitat universal dels espais públics. ","A1","A2","A3","A4","A5","A6","A7","A8","A9","A10","A11","A12","A13","A14","A15","A16","A17","A18","A19","A20","A21","A22","A23","A24","A25","A26","A27","A28","A29","A30"]
["2.3.1","Impulsar l'espai públic com a eix vertebrador de la ciutat amb entorns propicis per a garantir una vida saludable a tots els sectors de la població.  "]
["2.3.2","Fomentar la diversitat, la qualitat i la versatilitat dels espais públics, dotar-los d'un mobiliari adequat i polivalent, convenientment revisat i millorar-ne l'estètica, la conservació i la bellesa. Atendre el paisatge urbà."]
["2.3.3","Fomentar la cultura, l'intercanvi, la convivència i l'oci urbans, convertir els carrers en “places”, per a aconseguir que l'espai públic siga un senyal d'identitat. "]
["2.3.4","Fomentar les mesures d'intervenció en els espais públics i edificis que reduïsquen i/o eliminen els impactes negatius sobre la salut dels ciutadans."]
["2.3.5","Activar els espais de convivència com a fórmula per a millorar la salut psíquica dels ciutadans i trencar bambolles de soledat i d'aïllament, per a propiciar la diversitat d'usos, l'intercanvi cultural i el sentit de pertinença al lloc. "]
["2.3.6","Prendre en consideració la inclusió dels animals de companyia en la vida urbana i reconéixer la seua contribució a la salut física i mental de moltes persones."]
["2.3.7","Eliminar barreres arquitectòniques, perseguint la major autonomia de les persones amb discapacitat o amb mobilitat reduïda, millorant l'accessibilitat universal a espais i equipaments públics, habitatge i serveis bàsics. "]
["2.3.8","Assegurar el major confort possible de l'espai públic mitjançant el control del soroll, de la contaminació de l'aire i de la lumínica i de les condicions tèrmiques, per a fer-lo atractiu i saludable."]
["2.3.9","Alliberar espai públic ocupat per l'automòbil privat per a convertir-lo en espai públic d'ús múltiple i afavorir els usos per als vianants i el comerç local."]
["2.3.10","Generar espais públics segurs, la qual cosa en gran manera s'aconsegueix amb la seua ocupació constant. D'ací ve que garantir una densitat adequada del teixit urbà i activitats que contribuïsquen a aconseguir entorns transitats siga un bon instrument per a fer-ho. "]
["2.3.11","Avançar en la “geoprevenció”, és a dir, en previndre el crim mitjançant el disseny ambiental, per a assegurar una relació adequada entre el medi urbà i la seguretat pública. Les diferents vulnerabilitats procedents de situacions socioculturals, econòmiques o polítiques poden minimitzar-se amb eines encara per desenvolupar com el control natural dels accessos, la vigilància natural, el reforç del territori, el manteniment dels espais públics i la participació comunitària."]
["2.3.12","Garantir no només la seguretat contra la delinqüència, sinó també la seguretat enfront dels accidents, amb mesures preventives com el disseny de carrers amb pendents adequats, identificació de zones inaccessibles, avaluació de la jerarquització viària, atenció als encreuaments i interseccions dels vianants amb els vehicles, cura amb els acabats superficials urbans, etc."]
["2.4","Millorar el medi ambient urbà i reduir la contaminació.","A1","A2","A3","A4","A5","A6","A7","A8","A9","A10","A11","A12","A13","A14","A15","A16","A17","A18","A19","A20","A21","A22","A23","A24","A25","A26","A27","A28","A29","A30"]
["2.4.1","Garantir un hàbitat saludable i segur que permeta un desenvolupament cultural, social i econòmic ple. "]
["2.4.2","Fomentar la creació o millora de zones i infraestructures verdes, tant a escala de barri com de ciutat, a fi d'afavorir la vinculació de la ciutat amb la naturalesa i afavorir la continuïtat física de l'entorn."]
["2.4.3","Definir una superfície mínima de les zones verdes amb el criteri que un major percentatge de ciutadans tinga accés a una zona verda de proximitat que estiga adequadament dimensionada en funció de les necessitats existents, amb especial atenció al paisatge i al seu valor com a eina de qualitat de l'entorn urbà."]
["2.4.4","Fomentar actuacions per a reduir la contaminació acústica, lumínica i visual i minimitzar-ne l'impacte en la salut i en la qualitat de vida."]
["2.4.5","Posar en marxa mesures de reconversió de sòls urbans degradats en zones verdes i parcs per a contribuir a la millora del medi ambient urbà i a la reducció de la contaminació, mitjançant l'ús de tècniques de restauració ecològica. "]
["2.4.6","Descontaminar sòls d'usos industrials en desús i procedir a la seua recuperació ambiental amb caràcter previ a la nova utilització com a sòl urbà. "]
["2.4.7","Establir, en els instruments de planejament territorial i urbanístic, distàncies suficients entre els habitatges i tot tipus d'activitats contaminants de l'atmosfera, com els polígons industrials, les autopistes i les autovies."]
["2.5","Impulsar la regeneració urbana.","A1","A2","A3","A4","A5","A6","A7","A8","A9","A10","A11","A12","A13","A14","A15","A16","A17","A18","A19","A20","A21","A22","A23","A24","A25","A26","A27","A28","A29","A30"]
["2.5.1","Garantir la regeneració urbana integrada, de manera que les operacions físic-urbanístiques estiguen vinculades amb programes socials, educatius i laborals, actuant de manera prioritària en els barris que major vulnerabilitat urbana presenten."]
["2.5.2","Fomentar i impulsar la rehabilitació edificatòria i la regeneració urbana per a aconseguir un equilibri adequat entre aquesta activitat i la de generació de nova ciutat. Especialment, afavorir les propostes de regeneració urbana que provinguen de l'àmbit del cooperativisme."]
["2.5.3","Promoure la regeneració i la renovació urbanes a gran escala i vincular-les amb eines de lluita contra el canvi climàtic i amb l'existència d'un parc d'habitatges accessibles i assequibles mitjançant la rehabilitació. "]
["2.5.4","Identificar possibles increments de valor en l'edificació que puguen mobilitzar rehabilitacions integrals, tant públiques, com privades. Entre aquests l'augment de l'edificabilitat, l'augment del nombre d'habitatges, els canvis d'ús i la densificació de zones periurbanes de baixa densitat, així com definir eines que puguen condicionar aquestes tècniques a la creació d'un parc d'habitatge de qualitat, accessible i assequible."]
["2.5.5","Definir mètodes fiables i consensuats per a avaluar les actuacions de regeneració i renovació urbanes a gran escala que permeten millorar els procediments d'activació d'aquestes intervencions."]
["2.5.6","Posar en marxa mecanismes per a identificar sinergies entre diferents tipus d'intervenció a la ciutat consolidada des d'un enfocament integral i a llarg termini."]
["2.5.7","Afavorir des de les administracions públiques el finançament i la viabilitat de les actuacions de rehabilitació, regeneració i renovació urbanes, fins i tot fomentant la col·laboració del sector privat. "]
["2.5.8","Adoptar mesures per a evitar que la renovació urbana porte associats efectes col·laterals de gentrificació, que impliquen canvis inadequats en la morfologia urbana i pèrdua de la població resident."]
["2.5.9","Aprofitar el patrimoni cultural per a realitzar operacions de regeneració urbana, perquè és una vertadera oportunitat per a aquesta."]
["2.5.10","Fomentar l'autopromoció en els nuclis urbans dels pobles i ciutats més menuts, per a contribuir a la seua preservació i a l'objectiu de fixar població."]
["2.5.11","Arbitrar fórmules de divisió i segregació d'habitatges grans en diversos habitatges per a adaptar-les a configuracions que responguen a les demandes actuals, afavorir el lloguer i evitar la seua degradació per falta de manteniment."]
["2.5.12","Utilitzar metodologies de participació com ara tallers o fòrums, que permeten la implicació, des de l'inici i de manera continuada, del teixit social al llarg d'aquests processos de transformació urbana."]
["2.6","Millorar la qualitat i sostenibilitat dels edificis.","A1","A2","A3","A4","A5","A6","A7","A8","A9","A10","A11","A12","A13","A14","A15","A16","A17","A18","A19","A20","A21","A22","A23","A24","A25","A26","A27","A28","A29","A30"]
["2.6.1","Propiciar una visió integral de l'entorn construït, i no només de l'edificació."]
["2.6.2","Millorar l'estat de conservació, seguretat, manteniment dels edificis i l'habitabilitat dels habitatges."]
["2.6.3","Avançar cap a l'accessibilitat universal en edificis i habitatges."]
["2.6.4","Impulsar la millora de l'eficiència energètica del parc edificatori existent amb totes les mesures disponibles i possibles: fiscals, d'agilitació i simplificació dels tràmits administratius i mitjançant la posada en marxa de campanyes pedagògiques.   "]
["2.6.5","Promoure les inspeccions tècniques d'edificis o els informes d'avaluació dels edificis per a fomentar la posada en marxa de mesures preventives que impulsen el manteniment preventiu i no només corrector o pal·liatiu en els edificis."]
["2.6.6","Utilitzar mecanismes que permeten aconseguir sinergies entre els diferents tipus d'intervenció en els edificis: manteniment, accessibilitat, eficiència energètica, etc. Es tracta de potenciar l'actuació integral sobre aquests."]
["2.6.7","Emprar tècniques constructives eficients que garantisquen l'ús de materials adequats per als edificis i habitatges i que faciliten la reutilització. Es tractaria de “construir per a durar”. "]
["2.6.8","Impulsar l'ús i l'actualització del llibre de l'edifici durant la vida útil d'aquest. Fomentar el llibre de l'edifici “existent” en el qual consten les reparacions i rehabilitacions realitzades al llarg de la seua vida útil."]
["2.6.9","Impulsar mesures per a garantir la participació de tècnics i empreses de rehabilitació i reforma, que complisquen amb les seues obligacions professionals, per a garantir un correcte disseny i execució, que redunda en la qualitat, la seguretat i la tranquil·litat.  Un exemple podria ser la sol·licitud d'informació sobre l'empresa (REA, assegurança de responsabilitat civil, al dia en Hisenda i Seguretat Social, és a dir, dades objectives i obligatòries) a l'hora d'atorgar les llicències o possibles subvencions públiques."]
[]
[null,{"$f":"TABLAS!$AL$2","v":"FITXES PER A L'ELABORACIÓ D'UNA ESTRATÈGIA LOCAL DE REHABILITACIÓ DE L'ENTORN CONSTRUÏT"},{"$f":"IF(C$1=\"\",\"\",C$1)","v":"Error: sense assignar."},{"$f":"IF(D$1=\"\",\"\",D$1)","v":"Error: sense assignar."},"Error: sense assignar.","Error: sense assignar.","Error: sense assignar.","Error: sense assignar.","","","","","","","","","","","","","","","","","","","","","","","",""]
[null,{"$f":"IF($B$2=\"\",\"\",$B$2)","v":"ETAPA III: PROGRAMA D'ACTUACIONS"}]
[null,{"$f":"TABLAS!$AL$4","v":""}]
["LÍNIES D'ACTUACIÓ",null,"ACCIONS"]
[3,"PREVINDRE I REDUIR ELS IMPACTES DEL CANVI CLIMÀTIC I MILLORAR LA RESILIÈNCIA","A.1","A.2","A.3","A.4","A.5","A.6","A.7","A.8","A.9","A.10","A.11","A.12","A.13","A.14","A.15","A.16","A.17","A.18","A.19","A.20","A.21","A.22","A.23","A.24","A.25","A.26","A.27","A.28","A.29","A.30"]
["3,1","Adaptar el model territorial i urbà a l'efecte del canvi climàtic i avançar en la seua prevenció."]
["3.1.1","Desenvolupar un planejament sectorial, territorial i urbanístic que responga a la prevenció enfront dels riscos naturals i que garantisca l'aplicació de normes específiques sobre el tema, tant en les infraestructures, com en les instal·lacions i en les construccions i edificacions."]
["3.1.2","Incorporar mapes de riscos naturals al planejament, de manera que s'eviten actuacions de transformació urbana que siguen susceptibles de veure's afectades per inundacions, pluges torrencials, elevació del nivell de la mar, insuficiència hídrica, risc de lliscament de terra, etc."]
["3.1.3","Incloure noves previsions en els instruments de planejament, relacionades amb l'adaptació i la mitigació dels efectes del canvi climàtic: pujada de la mar, pèrdua de sòl fèrtil, pluges torrencials, incendis forestals, augment de les temperatures o grans períodes de sequera."]
["3.1.4","Posar en marxa plans d'emergència enfront del canvi climàtic i, més àmpliament, plans d'acció pel clima i l'energia sostenible."]
["3.1.5","Fomentar les actuacions de prevenció i adaptació en els sòls urbanitzats susceptibles de ser afectats per riscos naturals."]
["3.1.6","Incorporar a la planificació i a la gestió del territori i de l'urbanisme el concepte d'infraestructures verdes urbanes i blaves, com a solucions multifuncionals basades en la naturalesa, que resolen problemes urbans que van més enllà de les seues funcionalitats per a la millora de la biodiversitat com són: el tractament de zones inundables, la reducció d'illes de calor, la lluita contra el canvi climàtic, la reducció d'emissions GEH i, per descomptat, per a anar adaptant localment l'oci i el gaudi ciutadà en aquests espais. Seria oportú elaborar regulacions que guien la manera d'introduir-les en les polítiques urbanes, els mecanismes i marcs de finançament i determinats estàndards i indicadors, així com les campanyes específiques de sensibilització, especialment sobre els seus beneficis."]
["3.1.7","Reduir l'illa de calor de les actuals ciutats, actuant sobre els factors que influeixen en el comportament climàtic de l'entorn urbà. Per a fer-ho podria ser útil promoure la permeabilització i vegetació dels espais públics, incorporar en les eines de planificació i gestió urbana el mapatge del clima urbà."]
["3.1.8","Aprovar i posar en marxa plans i programes de reconversió industrial de les indústries contaminants per a millorar el comportament ambiental d'establiments industrials “madurs” i per a disminuir els efectes adversos de les seues activitats per a les persones i l'entorn."]
["3.1.9","Treballar mitjançant xarxes de ciutats (Xarxa del Clima, Xarxa Espanyola de Sostenibilitat Local, xarxes provincials de municipis per a la sostenibilitat, etc.) per a impulsar accions de mitigació i adaptació comunes en tots els municipis que la conformen. Per a fer-ho, és possible aconseguir pactes i aprovar estratègies que busquen la reducció d'accidents greus per desastres, la millora de la qualitat de l'aire, la reducció de l'impacte ambiental negatiu per càpita, la gestió dels residus i molts altres objectius. "]
["3.1.10","Fomentar campanyes de millora de l'educació i la sensibilització sobre la mitigació del canvi climàtic en la qual els usos i els hàbits de consum exercisquen un paper clau."]
["3.1.11","Fomentar la participació ciutadana i l'educació a la ciutadania com a eix important en la cura del medi ambient, sobretot del medi ambient urbà."]
["3.1.12","Posar en marxa una governança per a la gestió del risc veritablement democràtica, és a dir, amb implicació de tots els interessats (experts, governs, sector privat, societat civil, etc.) en la deliberació i també en la gestió mateixa."]
["3.2","Reduir les emissions de gasos d'efecte d'hivernacle. ","A1","A2","A3","A4","A5","A6","A7","A8","A9","A10","A11","A12","A13","A14","A15","A16","A17","A18","A19","A20","A21","A22","A23","A24","A25","A26","A27","A28","A29","A30"]
["3.2.1","Incentivar i impulsar un model urbà baix en carboni, seguint les mesures i recomanacions nacionals i internacionals (serveis públics, infraestructures, edificació, etc.)"]
["3.2.2","Ordenar els usos del sòl i de l'edificació tenint en compte aspectes bioclimàtics d'eficiència energètica i de funcionalitat."]
["3.2.3","Implementar les estratègies “zero emissions” en els entorns urbans."]
["3.2.4","Reduir la dependència del vehicle privat mitjançant el foment d'un model urbà compacte i complex i els impactes dels desplaçaments motoritzats. Això redundarà també en la reducció dels seus consums i emissions contaminants."]
["3.2.5","Utilitzar tecnologies netes, materials i productes que eliminen o minimitzen les emissions contaminants i de gasos d'efecte d'hivernacle."]
["3.2.6","Promoure la renovació del parc de vehicles."]
["3.3","Millorar la resiliència enfront del canvi climàtic.","A1","A2","A3","A4","A5","A6","A7","A8","A9","A10","A11","A12","A13","A14","A15","A16","A17","A18","A19","A20","A21","A22","A23","A24","A25","A26","A27","A28","A29","A30"]
["3.3.1","Elaborar plans de resiliència enfront del canvi climàtic i garantir que, quan existisquen, siguen coneguts i de fàcil accés als ciutadans. Aprofitar aquesta eina per a preservar i millorar les condicions de vida."]
["3.3.2","Aprofitar el paisatge com a oportunitat i valor de cada poble i ciutat, incorporar el terme de “restauració ecològica” i transformar en l'imaginari col·lectiu les zones verdes en models autòctons que permeten realitzar una gestió eficient dels recursos. "]
["3.3.3","Preparar-se per a ser resilients, és a dir, per a fer front a les possibles crisis (subministraments, vagues, avaries, desastres naturals, etc.) abans que arriben. Això requereix avaluar els diferents escenaris estudiant quins elements del sistema urbà estan més implicats, fer test d'estrés, optimitzar les inversions per a reduir els riscos i evitar les possibles fallades en cadena. Un diagnòstic adequat, la col·laboració de tots els actors necessaris, incloent-hi la societat civil i l'avaluació de la resiliència en anteriors crisis poden ser molt útils. Per a fer-ho es proposa l'aprovació de protocols d'actuació.  "]
["3.3.4","Cuidar la forma espacial de la ciutat, la morfologia (rugositat urbana, canó urbà, visibilitat del cel, etc.), la presència de vegetació, o l'albedo dels materials de les superfícies urbanes per a minimitzar l'impacte de les onades de calor, que veuen incrementats els efectes per la denominada “illa de calor urbana”. Aplicar criteris bioclimàtics en el disseny dels espais oberts. "]
["3.3.5","Tindre en compte en la planificació i en el disseny urbà, així com en el disseny i construcció dels edificis, el fenomen de l'illa de calor urbana. Per a fer-ho caldrà estudiar la influència de clima regional i local i elaborar un mapa de clima urbà, en el qual s'analitze la capacitat d'absorció i cessió de calor per part dels materials urbans (mapa de sobrecalfament) i la capacitat d'eliminació de la calor (mapa de ventilació urbana). Per a la construcció d'edificis s'estudiaran solucions d'arquitectura bioclimàtica que contribuïsquen a reduir les emissions de gasos d'efecte d'hivernacle."]
["3.3.6","Fomentar la conservació d'espècies animals i vegetals autòctones. Augmentar la superfície de sòl capaç de sostindre vegetació i millorar-ne la permeabilitat."]
["3.3.7","Desenvolupar projectes específics de prevenció de danys per inundacions."]
["3.3.8","Reduir la desforestació i millorar els ecosistemes."]
[]
[null,{"$f":"TABLAS!$AL$2","v":"FITXES PER A L'ELABORACIÓ D'UNA ESTRATÈGIA LOCAL DE REHABILITACIÓ DE L'ENTORN CONSTRUÏT"},{"$f":"IF(C$1=\"\",\"\",C$1)","v":"Error: sense assignar."},{"$f":"IF(D$1=\"\",\"\",D$1)","v":"Error: sense assignar."},"Error: sense assignar.","Error: sense assignar.","Error: sense assignar.","Error: sense assignar.","","","","","","","","","","","","","","","","","","","","","","","",""]
[null,{"$f":"IF($B$2=\"\",\"\",$B$2)","v":"ETAPA III: PROGRAMA D'ACTUACIONS"}]
[null,{"$f":"TABLAS!$AL$4","v":""}]
["LÍNIES D'ACTUACIÓ",null,"ACCIONS"]
[4,"FER UNA GESTIÓ SOSTENIBLE DELS RECURSOS I AFAVORIR L'ECONOMIA CIRCULAR","A.1","A.2","A.3","A.4","A.5","A.6","A.7","A.8","A.9","A.10","A.11","A.12","A.13","A.14","A.15","A.16","A.17","A.18","A.19","A.20","A.21","A.22","A.23","A.24","A.25","A.26","A.27","A.28","A.29","A.30"]
["4,1","Ser més eficients energèticament i estalviar energia."]
["4.1.1","Donar suport a la transició energètica en les ciutats i de les ciutats: en aquestes estan les claus. La generació distribuïda i l'autoconsum d'energia en l'àmbit urbà són eines bàsiques per a aquest canvi de model energètic. "]
["4.1.2","Contindre i fins i tot reduir la despesa d'energia, fomentar l'estalvi d'energia i promoure l'eficiència energètica mitjançant plans, estratègies o altres mesures. Entre aquestes: tindre en compte la morfologia urbana i les condicions bioclimàtiques de la ciutat; incorporar criteris d'arquitectura bioclimàtica passiva o maximitzar la prestació dels serveis de calefacció, refrigeració o il·luminació, amb el mínim consum possible."]
["4.1.3","Incloure mesures de prevenció i resiliència que previnguen i reduïsquen al màxim els riscos energètics (v. gr. xarxes elèctriques que permeten el subministrament alternatiu, etc.)"]
["4.1.4","Incloure objectius de descarbonització."]
["4.1.5","Fomentar l'ús d'energies renovables tèrmiques, de manera especial al parc edificatori, que hauria d'aprofitar la relativa baixa demanda energètica i el potencial de captació solar."]
["4.1.6","Fomentar l'ús compartit de xarxes d'infraestructures per als diferents serveis urbans. "]
["4.1.7","Fomentar l'ús de l'energia elèctrica en la mesura en què permeta contribuir als objectius d'eficiència energètica i energies renovables i deslocalitzar les emissions fora de les ciutats."]
["4.1.8","Dissenyar ordenances i alineacions que propicien la ubicació intel·ligent dels edificis tenint en compte les necessitats reals dels usuaris."]
["4.1.9","Comptar amb sistemes d'energia resilients, és a dir, que toleren les possibles pertorbacions sense tallar el subministrament d'energia als consumidors. La generació distribuïda d'origen renovable, o generació in-situ, permet comptar amb generació d'energia per mitjà de variades fonts situades en llocs el més pròxims possibles a les càrregues."]
["4.1.10","Facilitar l'autoconsum en cobertes municipals, mobiliari urbà, aparcaments en superfície, etc., i la incentivació de l'autoconsum en les cobertes d'edificis privats mitjançant mesures fiscals en l'àmbit local (llicències d'obra, IBI, etc.) "]
["4.1.11","Fomentar la contractació de serveis energètics en els edificis públics."]
["4.2","Optimitzar i reduir el consum d'aigua.","A1","A2","A3","A4","A5","A6","A7","A8","A9","A10","A11","A12","A13","A14","A15","A16","A17","A18","A19","A20","A21","A22","A23","A24","A25","A26","A27","A28","A29","A30"]
["4.2.1","Adoptar mesures per a disminuir el consum d'aigua i de la despesa energètica i emissions associades a la distribució i el tractament del recurs. "]
["4.2.2","Tractar i recuperar els llits naturals d'aigua i els recursos subterranis com a base dels proveïments urbans, aplicant, si és necessari, les noves tecnologies de tractament (osmosi inversa, nanofiltració) per a aconseguir una màxima qualitat. "]
["4.2.3","Desenvolupar una política de protecció de les zones de recàrrega dels aqüífers destinats totalment o parcialment al proveïment, i evitar la implantació d'activitats que puguen afectar la qualitat. "]
["4.2.4","Respectar i valorar en la distribució d'usos del sòl les zones humides."]
["4.2.5","Realitzar estrictes seguiments dels processos territorials i de les actuacions que poden generar contaminació difusa amb possibilitat d'afectar els recursos d'aigua amb destinació a les ciutats."]
["4.2.6","Independitzar, sempre que siga possible, els recursos superficials per a ús urbà, dels destinats a altres usos i protegir de manera efectiva les zones de captació."]
["4.2.7","Adequar la qualitat de l'aigua per a cada ús concret i fomentar la utilització de sistemes d'aprofitament d'aigües grises."]
["4.2.8","Fomentar la recollida selectiva, les xarxes separatives de sanejament i assegurar la proximitat de l'usuari a aquests sistemes per a afavorir l'activitat. "]
["4.2.9","Construir sistemes de depuració d'aigües no agressius amb l'entorn. A escala local, aplicar tractaments que eviten la devolució de l'aigua a la naturalesa contaminant-la o destruint la biodiversitat."]
["4.2.10","Fomentar tipus edificatoris amb menor demanda d'aigua i amb sistemes de recollida i reutilització d'aigües pluvials."]
["4.2.11","Utilitzar sistemes de retenció i filtració d'aigües pluvials, fomentar l'ús de paviments permeables i incloure dissenys de jardineria autòctona o estalviadora d'aigua mitjançant els sistemes eficients de reg. "]
["4.3","Fomentar el cicle dels materials.","A1","A2","A3","A4","A5","A6","A7","A8","A9","A10","A11","A12","A13","A14","A15","A16","A17","A18","A19","A20","A21","A22","A23","A24","A25","A26","A27","A28","A29","A30"]
["4.3.1","Aconseguir un tancament progressiu de cicles en el metabolisme de les ciutats, impulsant la reducció en origen dels residus, la inclusió de criteris de “cicle de vida” en el consum de materials i la reutilització i el reciclatge. "]
["4.3.2","Fomentar el consum responsable, les iniciatives de reparació, reutilització i refabricació i els sistemes col·laboratius i compartits de béns i serveis. "]
["4.3.3","Fomentar l'ús de matèries primeres secundàries i fàcilment reciclables procedents d'entorns locals."]
["4.3.4","Adoptar mesures per a separar en origen i gestionar els residus procedents de la construcció i incorporar-los en les noves obres d'edificació o rehabilitació quan tècnicament, ambientalment i normativament siga possible, i fomentar l'aprovació de plans de reutilització dels residus de la construcció. "]
["4.3.5","Potenciar la producció sota els paràmetres d'ecodisseny (materials ecològics, reutilitzables i valoritzables) i fomentar el seu consum."]
["4.3.6","Aprovar i implantar plans de renovació d'infraestructures municipals."]
["4.3.7","Proposar plans d'actuació sobre les pròpies activitats que s'han de realitzar en els serveis públics."]
["4.3.8","Establir criteris de compra pública circular en l'àmbit local que permeten tancar el cicle dels materials incloent-hi la compra i l'ús de productes i materials de segona mà. Especialment, caldria fomentar la utilització dels criteris sobre el cicle de vida dels materials en la contractació pública."]
["4.4","Reduir els residus i afavorir-ne el reciclatge.","A1","A2","A3","A4","A5","A6","A7","A8","A9","A10","A11","A12","A13","A14","A15","A16","A17","A18","A19","A20","A21","A22","A23","A24","A25","A26","A27","A28","A29","A30"]
["4.4.1","Potenciar l'ús de sistemes de depòsit, devolució i retorn, amb el consegüent estalvi de recursos i impactes ambientals i socioeconòmics. Aquesta línia d'actuació és bàsica per al desenvolupament d'una economia circular, com també ho són els plans de gestió de residus o els instruments equivalents."]
["4.4.2","Reservar des del planejament les zones més adequades per a solucionar els problemes de recollida i tractament dels residus i garantir que existisquen, en quantitat i qualitat suficients. Especialment, haurien de preveure's reserves de sòl per a compostatge i tractament de residus vegetals i bioresidus."]
["4.4.3","Dissociar la generació dels residus del desenvolupament econòmic mitjançant iniciatives de prevenció dels residus, amb un ús més eficaç dels recursos i amb un canvi cap a pautes de consum més sostenibles. "]
["4.4.4","Gestionar els residus per a reduir-ne l'impacte, obligant al tractament dels mateixos (siguen perillosos o no)."]
["4.4.5","Fomentar la separació en origen dels residus tèxtils, de la fracció orgànica i procedir a la gestió d'aquests, així com potenciar les recollides comercials en origen. "]
["4.4.6","Estudiar i aplicar nous models d'educació ambiental per a crear consciència ambiental i sensibilitat cap al consum i la generació de residus."]
[]
[null,{"$f":"TABLAS!$AL$2","v":"FITXES PER A L'ELABORACIÓ D'UNA ESTRATÈGIA LOCAL DE REHABILITACIÓ DE L'ENTORN CONSTRUÏT"},{"$f":"IF(C$1=\"\",\"\",C$1)","v":"Error: sense assignar."},{"$f":"IF(D$1=\"\",\"\",D$1)","v":"Error: sense assignar."},"Error: sense assignar.","Error: sense assignar.","Error: sense assignar.","Error: sense assignar.","","","","","","","","","","","","","","","","","","","","","","","",""]
[null,{"$f":"IF($B$2=\"\",\"\",$B$2)","v":"ETAPA III: PROGRAMA D'ACTUACIONS"}]
[null,{"$f":"TABLAS!$AL$4","v":""}]
["LÍNIES D'ACTUACIÓ",null,"ACCIONS"]
[5,"AFAVORIR LA PROXIMITAT I LA MOBILITAT SOSTENIBLE","A.1","A.2","A.3","A.4","A.5","A.6","A.7","A.8","A.9","A.10","A.11","A.12","A.13","A.14","A.15","A.16","A.17","A.18","A.19","A.20","A.21","A.22","A.23","A.24","A.25","A.26","A.27","A.28","A.29","A.30"]
["5,1","Afavorir la ciutat de proximitat."]
["5.1.1","Fomentar un model urbà d'usos mixtos que reduïsca distàncies en els viatges dins de la ciutat."]
["5.1.2","Promoure la connectivitat urbana i l'accessibilitat universal, amb patrons de proximitat entre la residència i el treball, per a limitar les exigències de mobilitat. "]
["5.1.3","Establir en els instruments d'ordenació un repartiment equilibrat de l'espai urbà destinat a mobilitat motoritzada i no motoritzada, d'acord amb les polítiques de desenvolupament sostenible de les ciutats. "]
["5.1.4","Prioritzar, en la mesura que siga possible, la ciutat per al vianant afavorint els itineraris continus, segurs i responsables i propiciant una forma de vida més saludable i activa."]
["5.1.5","Fomentar l'eficàcia i la qualitat dels tipus de transport més econòmics i a l'abast de tots els grups d'edat: transport públic, en bicicleta i a peu. "]
["5.1.6","Implementar models de desenvolupament urbanístic que incorporen plans de transport públic."]
["5.1.7","Fomentar cadenes metropolitanes o supramunicipals de transport públic i promoure'n la intermodalitat. "]
["5.1.8","Desenvolupar xarxes per als vianants i ciclistes, incloent-hi els nous desenvolupaments urbans, per a garantir desplaçaments no motoritzats segurs i en un entorn amigable. Elaborar ordenances de coexistència de ciclistes i vianants."]
["5.1.9","Adoptar mesures per a fomentar l'elaboració de plans de transport al treball en els principals centres d'activitat econòmica de l'àrea urbana per a racionalitzar els desplaçaments als centres de treball, així com estratègies de teletreball."]
["5.1.10","Establir plataformes logístiques de distribució en cada barri i gestionar la distribució de mercaderies en les zones urbanes, maximitzant els centres de consolidació/ruptura de càrregues i evitant la distribució amb baix nivell de càrrega de furgonetes i camions."]
["5.2","Potenciar tipus de transport sostenibles.","A1","A2","A3","A4","A5","A6","A7","A8","A9","A10","A11","A12","A13","A14","A15","A16","A17","A18","A19","A20","A21","A22","A23","A24","A25","A26","A27","A28","A29","A30"]
["5.2.1","Adoptar mesures mitjançant plans de mobilitat urbana sostenible, per a reduir els viatges en transport privat, fomentar els sistemes de transport públic eficients i millorar la qualitat dels desplaçaments per als vianants. En aquests plans hauria de fixar-se la prioritat per als vianants en la circulació urbana. "]
["5.2.2","Establir una oferta adequada de transport públic a escala urbana i construir xarxes integrades que interconnecten els tipus diferents. "]
["5.2.3","Dissenyar intercanviadors de transport que actuen com a nodes de transferència entre viatges interurbans i urbans."]
["5.2.4","Dotar-se d'una estratègia integral que incloga polítiques de dissuasió de la utilització de vehicles contaminants, dins d'un pla o programa més ampli que incloga altres alternatives. En aquest sentit, el pas dels actuals plans de mobilitat a plans estratègics que potencien els objectius estratègics de l'Agenda seria molt recomanable."]
["5.2.5","Situar aparcaments de dissuasió en la perifèria urbana, per a facilitar la transferència de l'usuari d'un vehicle privat al transport públic o al vehicle compartit. "]
["5.2.6","Situar les activitats perifèriques, que atrauen gran nombre de viatges, en punts d'alta accessibilitat als eixos de transports i als nodes de la xarxa de transport públic. "]
["5.2.7","Impulsar i afavorir l'ús de vehicles d'energies alternatives i híbrids. Implantar punts de recàrrega de cotxes elèctrics."]
["5.2.8","Promoure una visió integrada de la mobilitat al servei del ciutadà (MaaS, Mobility as a Service), i fomentar mesures que impulsen els sistemes de vehicle compartit, així com els serveis cooperatius lligats al transport públic."]
["5.2.9","Potenciar la mobilitat ciclista mitjançant el disseny de vies exclusives o prioritàries i aparcaments per a bicicletes."]
["5.2.10","Integrar la bicicleta amb el transport públic i impulsar les iniciatives d'oferta de bicicleta compartida. "]
["5.2.11","Integrar les xarxes per als vianants i ciclistes amb les zones verdes, per a garantir desplaçaments no motoritzats segurs i en un entorn amigable."]
["5.2.12","Garantir l'accessibilitat universal en tots els sistemes de transport."]
[]
[null,{"$f":"TABLAS!$AL$2","v":"FITXES PER A L'ELABORACIÓ D'UNA ESTRATÈGIA LOCAL DE REHABILITACIÓ DE L'ENTORN CONSTRUÏT"},{"$f":"IF(C$1=\"\",\"\",C$1)","v":"Error: sense assignar."},{"$f":"IF(D$1=\"\",\"\",D$1)","v":"Error: sense assignar."},"Error: sense assignar.","Error: sense assignar.","Error: sense assignar.","Error: sense assignar.","","","","","","","","","","","","","","","","","","","","","","","",""]
[null,{"$f":"IF($B$2=\"\",\"\",$B$2)","v":"ETAPA III: PROGRAMA D'ACTUACIONS"}]
[null,{"$f":"TABLAS!$AL$4","v":""}]
["LÍNIES D'ACTUACIÓ",null,"ACCIONS"]
[6," FOMENTAR LA COHESIÓ SOCIAL I BUSCAR L'EQUITAT","A.1","A.2","A.3","A.4","A.5","A.6","A.7","A.8","A.9","A.10","A.11","A.12","A.13","A.14","A.15","A.16","A.17","A.18","A.19","A.20","A.21","A.22","A.23","A.24","A.25","A.26","A.27","A.28","A.29","A.30"]
["6.1","Reduir el risc de pobresa i exclusió social en entorns urbans desfavorits."]
["6.1.1","Promoure una ciutat complexa i de proximitat, basada en barris ben equipats i segurs, ben connectats amb la ciutat i el territori. "]
["6.1.2","Identificar aquells barris o entorns urbans que presenten un major grau de vulnerabilitat social, econòmica i ambiental com a àrees d'actuació preferent per a afavorir l'equitat en el desenvolupament urbà i lluitar contra les bosses de pobresa, l'exclusió social i la desigualtat. Els Observatoris de Barris Vulnerables són eines útils a aquests efectes."]
["6.1.3","Fomentar la renovació i regeneració urbana integrada especialment en entorns urbans desfavorits o barris de major vulnerabilitat urbana. A tals efectes podrien abordar-se plans de caràcter integrat i integral."]
["6.1.4","Incloure en els plans i programes de caràcter social que s'elaboren i aproven mesures per a fer efectiu el principi d'igualtat d'oportunitats i de tracte entre dones i homes i els compromisos específics per a dur a terme les mesures que combaten els efectes negatius i els obstacles que tenen les dones a conseqüència de les múltiples discriminacions."]
["6.1.5","Fomentar la creació o la millora de serveis socials dirigits a persones en risc d'exclusió social i promoure campanyes de difusió dels serveis existents per a coneixement de la ciutadania. Adaptar els sistemes d'acolliment de persones i llars en situació de vulnerabilitat a les necessitats actuals, incloent-hi els fluxos migratoris."]
["6.1.6","Promoure l'assequibilitat dels serveis municipals per als col·lectius més vulnerables."]
["6.1.7","Promoure i afavorir l'activitat econòmica i comercial en aquests entorns urbans com a mesura de revitalització dels barris i de generació d'ocupació local."]
["6.1.8","Reduir els nivells de desigualtat, el risc de pobresa i l'exclusió social mitjançant mesures que actuen en els nivells de segregació espacial, residencial i dissimilitud."]
["6.1.9","Promoure l'ús de l'espai públic i la convivència ciutadana com a elements de cohesió social. Convertir els carrers en places, no només com a espais de gaudi i convivència comuns, sinó també com a espais públics inclusius. Garantir l'accessibilitat universal a aquests."]
["6.1.10","Promoure iniciatives comunitàries sense finalitats de lucre que possibiliten l'ús de l'espai públic."]
["6.1.11","Reforçar el sentit de pertinença a un lloc com a senyal d'identitat i el coneixement de l'entorn més pròxim."]
["6.1.12","Elaborar polítiques relatives a la seguretat pública i a la prevenció de la delinqüència i la violència evitant l'estigmatització de col·lectius vulnerables."]
["6.1.13","Adoptar mesures de prevenció i lluita contra l'abandó escolar. "]
["6.1.14","Actuar específicament en la reducció de la desigualtat, el risc de pobresa i l'exclusió social eliminant l'infrahabitatge i el barraquisme."]
["6.1.15","Adoptar mesures de suport a la formació i l'accés a l'ocupació."]
["6.2","Buscar la igualtat d'oportunitats des d'una perspectiva de gènere, edat i capacitat.","A1","A2","A3","A4","A5","A6","A7","A8","A9","A10","A11","A12","A13","A14","A15","A16","A17","A18","A19","A20","A21","A22","A23","A24","A25","A26","A27","A28","A29","A30"]
["6.2.1","Adoptar mesures mitjançant plans o estratègies per a garantir la igualtat de tracte i d'oportunitats, l'accés al mercat de treball i la vida pública en condicions d'igualtat que garantisquen la no discriminació per motiu d'origen racial o ètnic, discapacitat, identitat sexual, orientació sexual i de gènere, religió, opinió o qualsevol altra condició o circumstància personal o social."]
["6.2.2","Integrar la perspectiva de gènere, edat i capacitat en els temes relacionats amb el dia a dia de les ciutats, en les estructures administratives i en els processos de presa de decisions."]
["6.2.3","Adoptar mesures per a la detecció precoç de la vulnerabilitat o l'exclusió social en relació als processos d'ocupació il·legal de sòl i edificis, comptant amb espais i serveis de coordinació entre serveis socials, habitatge, seguretat ciutadana i salut per a l'acompanyament de les persones més vulnerables"]
["6.2.4","Garantir un nivell adequat de prestacions socials per a les persones amb discapacitat i en situació de dependència. "]
["6.2.5","Augmentar la seguretat ciutadana en els espais urbans adoptant les mesures adequades de disseny urbà (il·luminació, mobiliari, etc.) "]
["6.2.6","Augmentar la dotació de parcs en àrees residencials, freqüentats principalment per ancians, dones i xiquets, garantint una adequada accessibilitat, il·luminació i seguretat. "]
["6.2.7","Definir itineraris pavimentats que faciliten l'accessibilitat universal, que estiguen adequadament il·luminats i amb superfície d'ombra suficient per a gaudir de zones d'esplai."]
["6.2.8","Donar suport a la “mobilitat de la cura” assegurant que els viatges vinculats a la cura d'altres persones i el manteniment de la llar es puguen desenvolupar en el menor temps possible, en les franges horàries requerides i amb un cost assumible."]
["6.2.9","Fomentar el coneixement expert en la perspectiva de gènere, edat i discapacitat i l'urbanisme simultàniament i difondre'l entre la ciutadania, tractant d'eliminar clixés vells. "]
["6.2.10","Fomentar programes de voluntariat, activitats socials, etc. que afavorisquen la interrelació entre les persones que viuen soles i la socialització amb els veïns del barri, poble o ciutat."]
["6.2.11","Identificar i difondre bones pràctiques de planificació urbanística, arquitectònica i de mobilitat urbana i rural, que incidisquen favorablement en la conciliació de la vida personal, familiar i laboral, així com en l'autonomia de les persones."]
["6.2.12","Educar per a la igualtat de tracte per origen racial o ètnic, discapacitat, identitat sexual, orientació sexual i de gènere, religió, opinió o qualsevol altra condició o circumstància personal o social, la igualtat de gènere i la corresponsabilitat. "]
["6.2.13","Fomentar la creació d'activitats socials, culturals, etc., que afavorisquen la integració intercultural, des d'una perspectiva educativa, social, etc."]
["6.2.14","Fomentar l'associacionisme de barri."]
["6.2.15","Integrar transversalment de manera activa el principi d'igualtat de tracte per origen racial o ètnic, discapacitat, identitat sexual, orientació sexual i de gènere, religió, opinió o qualsevol altra condició o circumstància personal o social, i el principi d'igualtat de gènere en l'elaboració, execució i seguiment de les disposicions normatives, en la definició i pressupostos de les polítiques públiques en tots els àmbits i en el desenvolupament del conjunt de totes les seues activitats, considerant sistemàticament les prioritats i necessitats pròpies de les dones, tenint en compte la incidència en la seua situació específica, a fi d'adaptar-les per a eliminar els efectes discriminatoris i promoure la igualtat."]
[]
[null,{"$f":"TABLAS!$AL$2","v":"FITXES PER A L'ELABORACIÓ D'UNA ESTRATÈGIA LOCAL DE REHABILITACIÓ DE L'ENTORN CONSTRUÏT"},{"$f":"IF(C$1=\"\",\"\",C$1)","v":"Error: sense assignar."},{"$f":"IF(D$1=\"\",\"\",D$1)","v":"Error: sense assignar."},"Error: sense assignar.","Error: sense assignar.","Error: sense assignar.","Error: sense assignar.","","","","","","","","","","","","","","","","","","","","","","","",""]
[null,{"$f":"IF($B$2=\"\",\"\",$B$2)","v":"ETAPA III: PROGRAMA D'ACTUACIONS"}]
[null,{"$f":"TABLAS!$AL$4","v":""}]
["LÍNIES D'ACTUACIÓ",null,"ACCIONS"]
[7,"IMPULSAR I AFAVORIR L'ECONOMIA URBANA","A.1","A.2","A.3","A.4","A.5","A.6","A.7","A.8","A.9","A.10","A.11","A.12","A.13","A.14","A.15","A.16","A.17","A.18","A.19","A.20","A.21","A.22","A.23","A.24","A.25","A.26","A.27","A.28","A.29","A.30"]
["7.1","Buscar la productivitat local, la generació d'ocupació i la dinamització i diversificació de l'economia. "]
["7.1.1","Introduir les mesures necessàries per a coordinar l'ordenació territorial i urbanística amb la planificació sectorial de les activitats econòmiques, amb estratègies específiques per als xicotets nuclis de població i altres nuclis amb tendència al despoblament. "]
["7.1.2","Afavorir actuacions que permeten diversificar l'estructura productiva i generar oportunitats d'ocupació que garantisquen la qualitat de vida. "]
["7.1.3","Avançar mesures que tinguen en compte la pèrdua d'ocupacions previsible per la robotització imminent de molts procediments."]
["7.1.4","Impulsar la xarxa de ciutats intermèdies com a pols d'activitat regionals."]
["7.1.5","Garantir la compatibilitat de les activitats econòmiques amb els teixits residencials per a generar ocupació i millorar els teixits productius i, si escau, flexibilitzar els instruments d'ordenació urbanística per a poder respondre a la demanda real. "]
["7.1.6","Fomentar la innovació, l'ús de les noves tecnologies i el coneixement per a aconseguir una activitat econòmica competitiva i una major oferta d'ocupació. "]
["7.1.7","Fomentar l'accés a noves maneres de consum, el comerç electrònic i aprofitar els avantatges de l'economia circular. "]
["7.1.8","Afavorir les activitats econòmiques en l'àmbit rural i la producció local, l'alimentació de proximitat per a aconseguir la màxima interconnexió entre els àmbits rural i urbà, i tractar de limitar al màxim el transport dels aliments per a consumir menys recursos i afavorir l'alimentació de temporada més sana i mediambientalment més recomanable."]
["7.1.9","Incentivar el sector primari com a recurs econòmic dels municipis amb valors agrològics significatius."]
["7.1.10","Potenciar la riquesa del teixit associatiu i crear una estructura de col·laboració implicada en el barri o àrea urbana tan àmplia com siga possible. "]
["7.1.11","Fomentar l'economia social: l'associacionisme, les societats laborals, les cooperatives i les mutualitats que perseguisquen interessos generals. "]
["7.1.12","Generar espais atractius per a l'activitat econòmica i el comerç local i reservar espais per a comercialitzar els productes locals."]
["7.1.13","Preveure i fomentar espais de treball flexibles (coworking) en el centre de les ciutats, tant per la capacitat que tenen d'atraure a nous emprenedors, com per a abaratir el preu del lloguer convencional de les oficines. "]
["7.1.14","Crear bases estadístiques municipals que permeten a les ciutats tindre un millor coneixement de les dinàmiques econòmiques locals."]
["7.1.15","Aconseguir una estratègia d'estandardització en les dades que aconseguisca un accés real i efectiu a la informació que puga ser rellevant per als ciutadans. Això significa jerarquitzar les dades de manera homogènia perquè puguen creuar-se en els seus àmbits respectius (nacional, autonòmic i local) en l'espai i en el temps."]
["7.1.16","Garantir la correspondència entre la prestació dels serveis municipals amb la suficiència financera local mitjançant l'elaboració i el seguiment d'informes de sostenibilitat econòmica."]
["7.1.17","Avançar mesures que tinguen en compte la pèrdua d'ocupacions previsible per la quarta revolució tecnològica. Especialment per la derivada del comerç electrònic."]
["7.1.18","Fomentar la conciliació laboral i la igualtat d'oportunitats en l'accés al treball."]
["7.2","Fomentar el turisme intel·ligent, sostenible i de qualitat i els sectors clau de l'economia local.","A1","A2","A3","A4","A5","A6","A7","A8","A9","A10","A11","A12","A13","A14","A15","A16","A17","A18","A19","A20","A21","A22","A23","A24","A25","A26","A27","A28","A29","A30"]
["7.2.1","Impulsar la realització de diagnòstics i plans d'acció de destinació turística intel·ligent per a la millora de la sostenibilitat i la competitivitat de les destinacions turístiques."]
["7.2.2","Promoure l'aplicació de normes públiques UNE i sistemes de distinció en matèria de qualitat turística o de millora de la gestió turística com la Q de Qualitat o el SICTED (Sistema Integral de Qualitat Turística en Destinacions) o el distintiu de Destinació Turística Intel·ligent."]
["7.2.3","Realitzar plans turístics que tinguen una visió integrada en la qual es recullen accions a llarg termini i en els quals es permeta participar de manera efectiva a les comunitats locals. "]
["7.2.4","Impulsar el turisme urbà sostenible que gestione els fluxos de visitants i la capacitat de càrrega dels espais històrics per a evitar l'efecte de massificació, que siga respectuós amb el patrimoni cultural i que garantisca l'equilibri entre el turisme i el benestar per a les comunitats receptores. "]
["7.2.5","Regenerar i reconvertir les destinacions turístiques madures per a dotar-les d'uns estàndards de qualitat actuals. "]
["7.2.6","Apostar per la cultura, la gastronomia i els productes locals com a recursos propis i existents. "]
["7.2.7","Desenvolupar plans de màrqueting turístic que tinguen com a objectius primaris els perfils de turistes de qualitat, d'alta rendibilitat en la destinació urbana que visita, i amb un nivell cultural que permeta valorar el patrimoni de la ciutat. "]
["7.2.8","Aconseguir la desestacionalització del turisme, revalorant els recursos que fomenten l'equilibri socioterritorial, creant noves categories de producte que siguen capaços d'operar tot l'any. "]
["7.2.9","Afavorir l'ecoturisme i el turisme rural com a manera de dinamitzar econòmicament i de manera sostenible, entorns i nuclis territorials en regressió, amb la finalitat de diversificar la demanda d'activitat i de sectors econòmics. "]
["7.2.10","Disposar d'oferta cap a un turisme especialitzat amb activitats lligades a la innovació, la creativitat i l'oci. "]
[]
[]
[null,{"$f":"TABLAS!$AL$2","v":"FITXES PER A L'ELABORACIÓ D'UNA ESTRATÈGIA LOCAL DE REHABILITACIÓ DE L'ENTORN CONSTRUÏT"},{"$f":"IF(C$1=\"\",\"\",C$1)","v":"Error: sense assignar."},{"$f":"IF(D$1=\"\",\"\",D$1)","v":"Error: sense assignar."},"Error: sense assignar.","Error: sense assignar.","Error: sense assignar.","Error: sense assignar.","","","","","","","","","","","","","","","","","","","","","","","",""]
[null,{"$f":"IF($B$2=\"\",\"\",$B$2)","v":"ETAPA III: PROGRAMA D'ACTUACIONS"}]
[null,{"$f":"TABLAS!$AL$4","v":""}]
["LÍNIES D'ACTUACIÓ",null,"ACCIONS"]
[8,"GARANTIR L'ACCÉS A L'HABITATGE","A.1","A.2","A.3","A.4","A.5","A.6","A.7","A.8","A.9","A.10","A.11","A.12","A.13","A.14","A.15","A.16","A.17","A.18","A.19","A.20","A.21","A.22","A.23","A.24","A.25","A.26","A.27","A.28","A.29","A.30"]
["8.1","Fomentar l'existència d'un parc d'habitatge adequat a preu assequible."]
["8.1.1","Assegurar que el sòl vinculat a l’ús residencial per l’ordenació territorial i urbanística estiga al servei de l’efectivitat del dret a gaudir d’un habitatge digne i adequat. Per a aconseguir-ho cal fomentar l'ús efectiu dels habitatges que estiguen buits en les zones en què hi haja una demanda real i acreditada així com, si escau, utilitzar les mesures, tant de foment com fins i tot coercitives, que siguen precises, per a garantir que es compleix la funció social de la propietat i la destinació prioritària dels habitatges a l'ús residencial previst pel planejament urbanístic."]
["8.1.2","Promoure mesures d'acció positiva en la garantia del dret a accedir a un habitatge digne i adequat, tant per mitjà de l'habitatge de titularitat pública, com mitjançant mesures de foment que faciliten la posada en el mercat d'habitatges suficients a preus assequibles."]
["8.1.3","Propiciar una visió integral de l'habitatge com a element que s'integra en un entorn adequat."]
["8.1.4","Garantir unes determinades reserves de sòl per a habitatge subjecte a algun règim de protecció pública en el planejament mateix, i observar rigorosament un criteri de repartiment d’aquest que respecte la cohesió social i impedisca la formació de guetos. "]
["8.1.5","Impulsar la generació d'habitatges dotacionals públics o d'habitatges socials en els quals estiga garantida la titularitat pública de manera indefinida."]
["8.1.6","Afavorir el lloguer per a equilibrar aquesta forma de tinença amb l’habitatge en propietat. "]
["8.1.7","Millorar la seguretat, l'habitabilitat, l'accessibilitat universal i l'eficiència energètica dels habitatges."]
["8.1.8","Incloure les persones amb discapacitat com a beneficiaris específics en els plans i programes que ajuden a l'accés a un habitatge per a col·lectius vulnerables."]
["8.1.9","Evitar la gentrificació. Delimitar àmbits de tanteig i retracte en els quals l'Administració pública puga adquirir immobles per a fomentar el lloguer social. També serviria a aquest mateix fi l'adquisició finalista d'habitatges dins dels àmbits que han sigut objecte d'una operació de regeneració urbana amb important finançament públic."]
["8.1.10","Avançar en un concepte d'habitabilitat adaptat a les necessitats motivades per les noves configuracions familiars i a les condicions de vida actuals."]
["8.2","Garantir l'accés a l'habitatge, especialment dels col·lectius més vulnerables.","A1","A2","A3","A4","A5","A6","A7","A8","A9","A10","A11","A12","A13","A14","A15","A16","A17","A18","A19","A20","A21","A22","A23","A24","A25","A26","A27","A28","A29","A30"]
["8.2.1","Impulsar la creació de parcs d'habitatge públics i privats a preus assequibles, que permeten atendre, especialment, les necessitats de les persones més vulnerables mitjançant el lloguer. En concret, disposar d'un parc d'habitatge social suficient per a atendre les situacions de major vulnerabilitat social. Entre aquestes últimes, també les de les persones a les quals ha sobrevingut una discapacitat (per accident, esdeveniment de salut, envelliment, etc.), que, per aquesta raó, ja no poden romandre en l'habitatge en què residien."]
["8.2.2","Potenciar l'habitatge social, no només a partir de noves promocions, sinó mitjançant l'activació i la incorporació al mercat d'habitatges desocupats, de manera que es promou la rehabilitació del parc d'habitatge. Aquest habitatge hauria de tindre com a beneficiaris prioritaris totes aquelles persones que es troben en situació d'emergència humanitària o d'exclusió social severa."]
["8.2.3","Fomentar les ajudes al lloguer i altres ajudes socials, com les específiques per a realitzar obres d'accessibilitat, de manera que es garantisca l'accés a l'habitatge a aquells que tenen més problemes per a fer-ho. "]
["8.2.4","Fomentar i fins i tot exigir normativament l'existència de fons de reserva en les comunitats de propietaris d'edificis de tipologia residencial col·lectiva que coadjuven a la realització de les obres d'accessibilitat que siguen necessàries."]
["8.2.5","Implantar protocols primerencs de prevenció de desnonaments per a evitar que es produïsquen sense allotjaments alternatius, amb mesures adequades de seguiment i avaluació. "]
["8.2.6","Afavorir la consolidació de formes diverses de tinença de l'habitatge, a part de la propietat i el lloguer. Especialment, les que ofereix i pot arribar a oferir el cooperativisme."]
[]
[null,{"$f":"TABLAS!$AL$2","v":"FITXES PER A L'ELABORACIÓ D'UNA ESTRATÈGIA LOCAL DE REHABILITACIÓ DE L'ENTORN CONSTRUÏT"},{"$f":"IF(C$1=\"\",\"\",C$1)","v":"Error: sense assignar."},{"$f":"IF(D$1=\"\",\"\",D$1)","v":"Error: sense assignar."},"Error: sense assignar.","Error: sense assignar.","Error: sense assignar.","Error: sense assignar.","","","","","","","","","","","","","","","","","","","","","","","",""]
[null,{"$f":"IF($B$2=\"\",\"\",$B$2)","v":"ETAPA III: PROGRAMA D'ACTUACIONS"}]
[null,{"$f":"TABLAS!$AL$4","v":""}]
["LÍNIES D'ACTUACIÓ",null,"ACCIONS"]
[9,"LIDERAR I FOMENTAR LA INNOVACIÓ DIGITAL","A.1","A.2","A.3","A.4","A.5","A.6","A.7","A.8","A.9","A.10","A.11","A.12","A.13","A.14","A.15","A.16","A.17","A.18","A.19","A.20","A.21","A.22","A.23","A.24","A.25","A.26","A.27","A.28","A.29","A.30"]
["9.1","Afavorir la societat del coneixement i avançar cap al desenvolupament de les ciutats intel·ligents (smart cities)."]
["9.1.1","Promoure el desenvolupament de les destinacions turístiques intel·ligents com a cas particular de les smart cities al servei del desenvolupament sostenible de destinacions turístiques urbanes i rurals."]
["9.1.2","Adoptar mesures mitjançant plans o estratègies que afavorisquen la incorporació de les noves tecnologies del coneixement (dades massives i mineria de dades, intel·ligència artificial) en la gestió urbana per a avançar en un model urbà intel·ligent. També haurien d'establir-se estratègies que avancen en un model de territoris intel·ligents."]
["9.1.3","Impulsar la digitalització de les ciutats i dels serveis urbans mitjançant models eficients i sostenibles basats en plataformes digitals de gestió intel·ligent "]
["9.1.4","Facilitar l'accés a les xarxes de comunicacions mòbils modificant i adaptant les normatives autonòmiques i locals a la nova normativa estatal en la matèria."]
["9.1.5","Impulsar l'espai públic com a eix vertebrador de l'accés a les noves tecnologies per part del ciutadà."]
["9.1.6","Considerar el desplegament de les comunicacions electròniques com a equipament bàsic de les ciutats que ha de formar part de les determinacions estructurants dels instruments de planejament."]
["9.1.7","Impulsar les tecnologies netes en els processos d'informació i de comunicació i en els sistemes intel·ligents de transport, així com en la gestió eficient i sostenible dels recursos de la ciutat (energia, aigua, residus i medi ambient urbà). "]
["9.1.8","Apostar per un desenvolupament econòmic i competitiu de la ciutat basat en la innovació, la tecnologia i un millor aprofitament del capital social i humà."]
["9.2","Fomentar l'Administració electrònica i reduir la bretxa digital.","A1","A2","A3","A4","A5","A6","A7","A8","A9","A10","A11","A12","A13","A14","A15","A16","A17","A18","A19","A20","A21","A22","A23","A24","A25","A26","A27","A28","A29","A30"]
["9.2.1","Fomentar el govern obert i transparent (portals dades obertes) que es recolza en la tecnologia per a aconseguir qualitat i eficiència en els serveis i activitat i per a incentivar la participació ciutadana en els processos de decisió que afecten la ciutat."]
["9.2.2","Promoure l'existència de portals oberts d'informació en els quals es puga accedir a dades en brut i no manipulades, amb els quals posteriorment poder treballar amb garantia de certesa que afavorisca, a més, l'intercanvi d'informació entre les ciutats. "]
["9.2.3","Establir mecanismes i estratègies de jerarquització i homogeneïtzació de la informació de manera que siga comparable en l'espai i en el temps i accessible per a tots."]
["9.2.4","Augmentar els serveis d'administració electrònica de manera que es faciliten els procediments administratius a ciutadans i empreses."]
["9.2.5","Adoptar mesures d'innovació tecnològica amb aplicacions que acosten el ciutadà als serveis públics. També està relacionada amb el vehicle elèctric i autònom."]
["9.2.6","Disposar d'estratègies d'alfabetització digital de col·lectius vulnerables (aturats de llarga duració, persones majors, etc.) amb la finalitat de reduir la bretxa digital."]
["9.2.7","Millorar la formació especialitzada en aquestes matèries, tant per part dels empleats públics com de la societat en general."]
[]
[null,{"$f":"TABLAS!$AL$2","v":"FITXES PER A L'ELABORACIÓ D'UNA ESTRATÈGIA LOCAL DE REHABILITACIÓ DE L'ENTORN CONSTRUÏT"},{"$f":"IF(C$1=\"\",\"\",C$1)","v":"Error: sense assignar."},{"$f":"IF(D$1=\"\",\"\",D$1)","v":"Error: sense assignar."},"Error: sense assignar.","Error: sense assignar.","Error: sense assignar.","Error: sense assignar.","","","","","","","","","","","","","","","","","","","","","","","",""]
[null,{"$f":"IF($B$2=\"\",\"\",$B$2)","v":"ETAPA III: PROGRAMA D'ACTUACIONS"}]
[null,{"$f":"TABLAS!$AL$4","v":""}]
["LÍNIES D'ACTUACIÓ",null,"ACCIONS"]
[10," MILLORAR ELS INSTRUMENTS D'INTERVENCIÓ I LA GOVERNANÇA","A.1","A.2","A.3","A.4","A.5","A.6","A.7","A.8","A.9","A.10","A.11","A.12","A.13","A.14","A.15","A.16","A.17","A.18","A.19","A.20","A.21","A.22","A.23","A.24","A.25","A.26","A.27","A.28","A.29","A.30"]
["10.1","Aconseguir un marc normatiu i de planejament actualitzat, flexible i simplificat que millore, també, la gestió."]
["10.1.1","Simplificar el marc normatiu existent i garantir-ne l'estabilitat. Per a fer-ho seria útil aconseguir, mitjançant un pacte global, unes bases comunament acceptades al voltant dels grans objectius estratègics en matèria d'ordenació territorial i urbanisme que admeten adaptacions menors i parcials."]
["10.1.2","Generar un marc normatiu que promoga una integració adequada de la tramitació ambiental i la dels plans urbanístics o territorials, propugnant una simultaneïtat en els tràmits."]
["10.1.3","Remetre a desenvolupament reglamentari tot allò que puga fer rígida en extrem l'aplicació de la norma legal."]
["10.1.4","Desenvolupar de manera efectiva la planificació d'ordenació territorial a escala regional i subregional que encara falta en moltes comunitats autònomes, la qual cosa possibilitarà un acostament multinivell i multiescala al territori, a la ciutat i a la resta de les poblacions."]
["10.1.5","Millorar el sistema tradicional de planejament urbanístic, dotant de major caràcter estratègic els plans generals i remetent l'ordenació detallada al planejament de desenvolupament, que és més àgil i flexible en la seua modificació i revisió. "]
["10.1.6","Recuperar el paper de la planificació com a instrument per a aconseguir que les ciutats siguen espais de redistribució i inclusió."]
["10.1.7","Agilitar i unificar procediments de tramitació i aprovació dels instruments de planejament i flexibilitzar i fer més àgil la gestió urbanística (els plans i les llicències i autoritzacions haurien de reduir sensiblement els terminis de tramitació i aprovació actuals)."]
["10.1.8","Garantir una integració adequada dels aspectes sectorials en la planificació territorial i urbanística, fins i tot abordant els canvis legislatius necessaris. Per a fer-ho, es proposen com a instruments adequats les finestretes úniques de tramitació d'aquests informes en cada nivell d'Administració pública i procediments i terminis breus d'emissió, i iguals, per a tots aquests. "]
["10.1.9","Elaborar guies o catàlegs dels informes sectorials que es requereixen per a poder tramitar i aprovar els instruments de planejament."]
["10.1.10","Garantir en els instruments de planejament un tractament adaptat als objectius de l'Agenda Urbana Espanyola."]
["10.1.11","En l'Administració local disposar d'ordenances municipals que siguen compatibles amb la normativa estatal i autonòmica i que permeten aplicar les dues sense llacunes, ni problemes interpretatius."]
["10.1.12","Crear instruments adequats per a la intervenció en les àrees consolidades, mitjançant operacions de rehabilitació, regeneració i renovació urbanes."]
["10.1.13","Propiciar que, en els municipis més xicotets, es fomente l'autopromoció d'habitatge com a instrument per a evitar el despoblament (v. gr. recuperant la previsió de les normes complementàries i subsidiàries que establien la construcció d'edificis amb PB+II."]
["10.2","Assegurar la participació ciutadana, la transparència i afavorir la governança multinivell.","A1","A2","A3","A4","A5","A6","A7","A8","A9","A10","A11","A12","A13","A14","A15","A16","A17","A18","A19","A20","A21","A22","A23","A24","A25","A26","A27","A28","A29","A30"]
["10.2.1","Fomentar i afavorir la governança multinivell entre el planejament territorial i l'urbanístic, mitjançant la utilització de fórmules supramunicipals o de coordinació i col·laboració interadministrativa per a superar les insuficiències dels xicotets nuclis de població: diputacions, capítols, comarques, associacions municipals amb una finalitat específica, etc. L'experiència, fins i tot, d'estructures transfrontereres, com la que proposa Agenda Urbana de l'Eixo Atlántico, juguen a favor d'una bona governança, com ho fan també els plans supramunicipals vinculats amb els plans de desenvolupament rural sostenible (per exemple, els relatius a projectes de reserva de la biosfera a escala comarcal)."]
["10.2.2","Buscar el reequilibri intern de les ciutats amb una gestió adequada del territori i de les persones. Els districtes poden ser un espai físic adequat per a posar en marxa iniciatives integrades de reequilibri territorial i social."]
["10.2.3","Enfortir els mecanismes i institucions jurídiques de col·laboració publicoprivada i la coproducció de polítiques públiques. "]
["10.2.4","Buscar la major eficàcia i eficiència de les Administracions públiques, evita les duplicitats entre aquestes i les disfuncions."]
["10.2.5","Potenciar els instruments de col·laboració horitzontal juntament amb els de caràcter sectorial com a manera d'aconseguir una visió de conjunt que optimitze l'ús dels recursos, en tots els àmbits d'Administració pública."]
["10.2.6","Garantir un procediment participatiu obert a tota la ciutadania que siga previ al procediment formal d'elaboració dels instruments d'ordenació territorial i urbanística com a manera d'assegurar una vertadera participació ciutadana. "]
["10.2.7","Fomentar la participació en el disseny, seguiment i avaluació de polítiques públiques per part de les persones, les famílies, els pobles i les comunitats. L'accessibilitat a la informació és clau per a aconseguir aquesta participació."]
["10.2.8","Integrar la participació en el planejament de manera real i efectiva durant tot el procés i més enllà dels tràmits obligatoris d'informació al públic i al·legacions. Cal buscar la corresponsabilitat en l'adopció de les decisions, fomentar el treball en xarxa i la permanent innovació social."]
["10.2.9","Impulsar els pressupostos participatius en els governs locals. "]
["10.2.10","Fomentar la transparència i les dades obertes en la planificació i en la gestió dels assumptes públics així com la rendició de comptes de l'actuació pública. "]
["10.2.11","Impulsar la creació d'oficines permanents que faciliten informació sobre la ciutat, el seu funcionament i la seua gestió, de manera que es genere un sentiment de participació i d'agent actiu a la ciutat. La mesura podria complementar-se amb l'impuls de la figura dels “mediadors o “agents” professionals que, mitjançant l'aportació de coneixements específics poden facilitar aquestes tasques."]
["10.2.12","Elaborar guies de funcionament de la ciutat accessibles a través de les noves tecnologies."]
["10.2.13","Elaborar mapes d'informació de la ciutat que permeten creuar les dades de tots els serveis oferits perquè, mitjançant l'anàlisi, es puguen introduir millores i identificar patrons."]
["10.2.14","Crear bases estadístiques municipals que permeten a les ciutats tindre un millor coneixement de les dinàmiques econòmiques locals."]
["10.3","Impulsar la capacitació local i millorar el finançament.","A1","A2","A3","A4","A5","A6","A7","A8","A9","A10","A11","A12","A13","A14","A15","A16","A17","A18","A19","A20","A21","A22","A23","A24","A25","A26","A27","A28","A29","A30"]
["10.3.1","Garantir l'adequat coneixement de tots els programes i línies d'ajudes públiques (internacionals, nacionals, autonòmiques i locals) existents al servei dels objectius de l'Agenda Urbana Espanyola. Especialment entre els tècnics municipals, als quals hauria de formar-se en la gestió d'aquests programes per al seu major aprofitament."]
["10.3.2","Vincular l'obtenció de finançament públic al compliment del marc estratègic previst en l'Agenda Urbana i a l'elaboració del corresponent pla d'acció que comporte un diagnòstic previ considerant els objectius estratègics i els específics."]
["10.3.3","Millorar el finançament de les polítiques i els serveis que necessàriament s'han de prestar. "]
["10.3.4","Proposar que els municipis menors de 20.000 habitants puguen tindre accés a les estratègies de desenvolupament urbà sostenible (EDUSI), i si no és així, tractar d'aconseguir aquest objectiu a escala estrictament de l'Estat espanyol."]
["10.3.5","Obrir la convocatòria a conjunts de municipis de diferents C. A. encara que s'haja de mantindre el llindar dels 20.000 habitants."]
["10.3.6","Relacionar els pressupostos municipals amb el compliment dels objectius de l'Agenda."]
["10.3.7","Resoldre els dèficits de recursos tècnics i humans de les administracions encarregades d'implementar l'Agenda 2030 i l'Agenda Urbana."]
["10.3.8","Fer prevaldre la consecució de resultats i la implantació de bones pràctiques com a criteris objectius per a la distribució territorial de finançament."]
["10.3.9","Fomentar el mecenatge com a mitjà de finançament privat d'iniciatives i projectes per a fins d'interés general."]
["10.3.10","Fomentar el microfinançament com a mitjà de finançament col·lectiu d'iniciatives i projectes."]
["10.3.11","Fomentar i impulsar la investigació urbana i urbanística."]
["10.3.12","Fomentar els cursos i programes de formació relacionats amb les temàtiques nacionals i internacionals que engloben les agendes urbanes, per als tècnics responsables, en les Administracions públiques, si es du a terme la implementació."]
["10.4","Dissenyar i posar en marxa campanyes de formació i sensibilització en matèria urbana i l'intercanvi i difusió del coneixement.","A1","A2","A3","A4","A5","A6","A7","A8","A9","A10","A11","A12","A13","A14","A15","A16","A17","A18","A19","A20","A21","A22","A23","A24","A25","A26","A27","A28","A29","A30"]
["10.4.1","Fomentar l'educació, la formació i la sensibilització ciutadana específicament en matèria d'urbanisme, i de manera particular tractar de generar una cultura de la conservació, manteniment i rehabilitació del patrimoni edificat i construït (tant el comú, com el privat).  "]
["10.4.2","Crear estructures estables d'informació amb seus físiques concretes que tinguen entre els seus objectius educar en el funcionament de la ciutat i ajuden a generar una cultura de participació ciutadana i a establir canals adequats i accessibles perquè siga real i efectiva, tenint en compte la diversitat humana que comporten els fenòmens urbans. "]
["10.4.3","Realitzar labors didàctiques que acosten els instruments d'ordenació territorial i urbanística als ciutadans, utilitzant eines adequades que els permeten entendre la seua transcendència per a la qualitat de vida."]
["10.4.4","Elaborar materials divulgatius específics sobre el desenvolupament urbà, les ciutats, la seua vinculació amb els ODS i la urbanitat. "]
["10.4.5","Desenvolupar cursos, tallers i debats d'urbanisme. La col·laboració amb universitats, col·legis professionals i el sector privat, a més de la pròpia col·laboració interadministrativa pot ser un element molt útil i enriquidor, perquè només des de la formació i la informació es podran prendre decisions eficaces i no demagògiques."]
["10.4.6","Fomentar el diàleg civil, entés com aquell que permet a les organitzacions i associacions representatives d'interessos diversos (persones amb discapacitat, famílies, veïns, etc.) participar en l'elaboració, execució, seguiment i avaluació de les polítiques públiques que els afecten. Aquest objectiu inclouria el foment de la mateixa creació i manteniment d'aquestes associacions i organitzacions com a vertaderes vies de participació democràtica en els assumptes públics."]
["10.4.7","Fomentar les experiències basades en la transferència de projectes pilot reeixits en altres llocs. Es tractaria de compartir la manera en què es poden abordar problemes comuns amb solucions de provada i contrastada utilitat, treballant per mitjà de xarxes de ciutats, tant nacionals com internacionals. El treball per mitjà d'espais digitals pot resultar molt útil a aquest efecte."]

{"sheet":"ETAPA III.b","index":10,"n_rows":40,"n_cols":45,"rows_kept":40,"cut":false,"hidden":false,"merged":[[8,13,8,16],[8,17,8,20],[8,21,8,24],[7,1,7,4],[7,5,7,8],[7,9,7,12],[7,13,7,16],[7,17,7,20],[0,4,0,40],[6,0,9,0],[2,28,2,40],[6,1,6,40],[7,21,7,24],[7,25,7,28],[7,29,7,32],[7,33,7,36],[7,37,7,40],[8,25,8,28],[8,29,8,32],[8,33,8,36],[8,37,8,40],[8,1,8,4],[8,5,8,8],[8,9,8,12]]}
[null,null,null,null,{"$f":"TABLAS!$AL$2","v":"FITXES PER A L'ELABORACIÓ D'UNA ESTRATÈGIA LOCAL DE REHABILITACIÓ DE L'ENTORN CONSTRUÏT"},null,null,null,null,null,null,null,null,null,null,null,null,null,null,null,null,null,null,null,null,null,null,null,null,null,null,null,null,null,null,null,null,null,null,null,null,null,"OCULTAR","OCULTAR","OCULTAR"]
[null,null,null,null,null,null,null,null,null,null,null,null,null,null,null,null,null,null,null,null,null,null,null,null,null,null,null,null,null,null,null,null,null,null,null,null,null,null,null,null,{"$f":"TABLAS!$AL$6","v":"ETAPA III: PROGRAMA D'ACTUACIONS"}]
[null,null,null,null,null,null,null,null,null,null,null,null,null,null,null,null,null,null,null,null,null,null,null,null,null,null,null,null,{"$f":"TABLAS!$AL$4","v":""}]
[]
["  III.b  Diagrama de Gantt"]
[]
["Accions","Pressupost i calendari de les accions",null,null,null,null,null,null,null,null,null,null,null,null,null,null,null,null,null,null,null,null,null,null,null,null,null,null,null,null,null,null,null,null,null,null,null,null,null,null,null,"TOTAL"]
[null,{"$f":"SUM(INDIRECT(CONCATENATE(SUBSTITUTE(ADDRESS(1,COLUMN()),1,\"\"),\"11:\",SUBSTITUTE(ADDRESS(1,COLUMN()+3),1,\"\"),10+'ETAPA III.a'!$I$4)))","v":{"$error":"#N/A"}},null,null,null,{"$f":"SUM(INDIRECT(CONCATENATE(SUBSTITUTE(ADDRESS(1,COLUMN()),1,\"\"),\"11:\",SUBSTITUTE(ADDRESS(1,COLUMN()+3),1,\"\"),10+'ETAPA III.a'!$I$4)))","v":{"$error":"#N/A"}},null,null,null,{"$f":"SUM(INDIRECT(CONCATENATE(SUBSTITUTE(ADDRESS(1,COLUMN()),1,\"\"),\"11:\",SUBSTITUTE(ADDRESS(1,COLUMN()+3),1,\"\"),10+'ETAPA III.a'!$I$4)))","v":{"$error":"#N/A"}},null,null,null,{"$f":"SUM(INDIRECT(CONCATENATE(SUBSTITUTE(ADDRESS(1,COLUMN()),1,\"\"),\"11:\",SUBSTITUTE(ADDRESS(1,COLUMN()+3),1,\"\"),10+'ETAPA III.a'!$I$4)))","v":{"$error":"#N/A"}},null,null,null,{"$f":"SUM(INDIRECT(CONCATENATE(SUBSTITUTE(ADDRESS(1,COLUMN()),1,\"\"),\"11:\",SUBSTITUTE(ADDRESS(1,COLUMN()+3),1,\"\"),10+'ETAPA III.a'!$I$4)))","v":{"$error":"#N/A"}},null,null,null,{"$f":"SUM(INDIRECT(CONCATENATE(SUBSTITUTE(ADDRESS(1,COLUMN()),1,\"\"),\"11:\",SUBSTITUTE(ADDRESS(1,COLUMN()+3),1,\"\"),10+'ETAPA III.a'!$I$4)))","v":{"$error":"#N/A"}},null,null,null,{"$f":"SUM(INDIRECT(CONCATENATE(SUBSTITUTE(ADDRESS(1,COLUMN()),1,\"\"),\"11:\",SUBSTITUTE(ADDRESS(1,COLUMN()+3),1,\"\"),10+'ETAPA III.a'!$I$4)))","v":{"$error":"#N/A"}},null,null,null,{"$f":"SUM(INDIRECT(CONCATENATE(SUBSTITUTE(ADDRESS(1,COLUMN()),1,\"\"),\"11:\",SUBSTITUTE(ADDRESS(1,COLUMN()+3),1,\"\"),10+'ETAPA III.a'!$I$4)))","v":{"$error":"#N/A"}},null,null,null,{"$f":"SUM(INDIRECT(CONCATENATE(SUBSTITUTE(ADDRESS(1,COLUMN()),1,\"\"),\"11:\",SUBSTITUTE(ADDRESS(1,COLUMN()+3),1,\"\"),10+'ETAPA III.a'!$I$4)))","v":{"$error":"#N/A"}},null,null,null,{"$f":"SUM(INDIRECT(CONCATENATE(SUBSTITUTE(ADDRESS(1,COLUMN()),1,\"\"),\"11:\",SUBSTITUTE(ADDRESS(1,COLUMN()+3),1,\"\"),10+'ETAPA III.a'!$I$4)))","v":{"$error":"#N/A"}},null,null,null,{"$f":"SUM(B8:AO8)","v":{"$error":"#N/A"}}]
[null,2021,null,null,null,2022,null,null,null,2023,null,null,null,2024,null,null,null,2025,null,null,null,2026,null,null,null,2027,null,null,null,2028,null,null,null,2029,null,null,null,2030]
[null,"T1","T2","T3","T4","T1","T2","T3","T4","T1","T2","T3","T4","T1","T2","T3","T4","T1","T2","T3","T4","T1","T2","T3","T4","T1","T2","T3","T4","T1","T2","T3","T4","T1","T2","T3","T4","T1","T2","T3","T4"]
[1,{"$f":"IF(COLUMN()>=INDIRECT(AQ11),IF(COLUMN()<=INDIRECT(AR11),INDIRECT(AS11),\"\"),\"\")","v":{"$error":"#N/A"}},{"$f":"IF(COLUMN()>=INDIRECT(AQ11),IF(COLUMN()<=INDIRECT(AR11),INDIRECT(AS11),\"\"),\"\")","v":{"$error":"#N/A"}},{"$f":"IF(COLUMN()>=INDIRECT(AQ11),IF(COLUMN()<=INDIRECT(AR11),INDIRECT(AS11),\"\"),\"\")","v":{"$error":"#N/A"}},{"$f":"IF(COLUMN()>=INDIRECT(AQ11),IF(COLUMN()<=INDIRECT(AR11),INDIRECT(AS11),\"\"),\"\")","v":{"$error":"#N/A"}},{"$f":"IF(COLUMN()>=INDIRECT(AQ11),IF(COLUMN()<=INDIRECT(AR11),INDIRECT(AS11),\"\"),\"\")","v":{"$error":"#N/A"}},{"$f":"IF(COLUMN()>=INDIRECT(AQ11),IF(COLUMN()<=INDIRECT(AR11),INDIRECT(AS11),\"\"),\"\")","v":{"$error":"#N/A"}},{"$f":"IF(COLUMN()>=INDIRECT(AQ11),IF(COLUMN()<=INDIRECT(AR11),INDIRECT(AS11),\"\"),\"\")","v":{"$error":"#N/A"}},{"$f":"IF(COLUMN()>=INDIRECT(AQ11),IF(COLUMN()<=INDIRECT(AR11),INDIRECT(AS11),\"\"),\"\")","v":{"$error":"#N/A"}},{"$f":"IF(COLUMN()>=INDIRECT(AQ11),IF(COLUMN()<=INDIRECT(AR11),INDIRECT(AS11),\"\"),\"\")","v":{"$error":"#N/A"}},{"$f":"IF(COLUMN()>=INDIRECT(AQ11),IF(COLUMN()<=INDIRECT(AR11),INDIRECT(AS11),\"\"),\"\")","v":{"$error":"#N/A"}},{"$f":"IF(COLUMN()>=INDIRECT(AQ11),IF(COLUMN()<=INDIRECT(AR11),INDIRECT(AS11),\"\"),\"\")","v":{"$error":"#N/A"}},{"$f":"IF(COLUMN()>=INDIRECT(AQ11),IF(COLUMN()<=INDIRECT(AR11),INDIRECT(AS11),\"\"),\"\")","v":{"$error":"#N/A"}},{"$f":"IF(COLUMN()>=INDIRECT(AQ11),IF(COLUMN()<=INDIRECT(AR11),INDIRECT(AS11),\"\"),\"\")","v":{"$error":"#N/A"}},{"$f":"IF(COLUMN()>=INDIRECT(AQ11),IF(COLUMN()<=INDIRECT(AR11),INDIRECT(AS11),\"\"),\"\")","v":{"$error":"#N/A"}},{"$f":"IF(COLUMN()>=INDIRECT(AQ11),IF(COLUMN()<=INDIRECT(AR11),INDIRECT(AS11),\"\"),\"\")","v":{"$error":"#N/A"}},{"$f":"IF(COLUMN()>=INDIRECT(AQ11),IF(COLUMN()<=INDIRECT(AR11),INDIRECT(AS11),\"\"),\"\")","v":{"$error":"#N/A"}},{"$f":"IF(COLUMN()>=INDIRECT(AQ11),IF(COLUMN()<=INDIRECT(AR11),INDIRECT(AS11),\"\"),\"\")","v":{"$error":"#N/A"}},{"$f":"IF(COLUMN()>=INDIRECT(AQ11),IF(COLUMN()<=INDIRECT(AR11),INDIRECT(AS11),\"\"),\"\")","v":{"$error":"#N/A"}},{"$f":"IF(COLUMN()>=INDIRECT(AQ11),IF(COLUMN()<=INDIRECT(AR11),INDIRECT(AS11),\"\"),\"\")","v":{"$error":"#N/A"}},{"$f":"IF(COLUMN()>=INDIRECT(AQ11),IF(COLUMN()<=INDIRECT(AR11),INDIRECT(AS11),\"\"),\"\")","v":{"$error":"#N/A"}},{"$f":"IF(COLUMN()>=INDIRECT(AQ11),IF(COLUMN()<=INDIRECT(AR11),INDIRECT(AS11),\"\"),\"\")","v":{"$error":"#N/A"}},{"$f":"IF(COLUMN()>=INDIRECT(AQ11),IF(COLUMN()<=INDIRECT(AR11),INDIRECT(AS11),\"\"),\"\")","v":{"$error":"#N/A"}},{"$f":"IF(COLUMN()>=INDIRECT(AQ11),IF(COLUMN()<=INDIRECT(AR11),INDIRECT(AS11),\"\"),\"\")","v":{"$error":"#N/A"}},{"$f":"IF(COLUMN()>=INDIRECT(AQ11),IF(COLUMN()<=INDIRECT(AR11),INDIRECT(AS11),\"\"),\"\")","v":{"$error":"#N/A"}},{"$f":"IF(COLUMN()>=INDIRECT(AQ11),IF(COLUMN()<=INDIRECT(AR11),INDIRECT(AS11),\"\"),\"\")","v":{"$error":"#N/A"}},{"$f":"IF(COLUMN()>=INDIRECT(AQ11),IF(COLUMN()<=INDIRECT(AR11),INDIRECT(AS11),\"\"),\"\")","v":{"$error":"#N/A"}},{"$f":"IF(COLUMN()>=INDIRECT(AQ11),IF(COLUMN()<=INDIRECT(AR11),INDIRECT(AS11),\"\"),\"\")","v":{"$error":"#N/A"}},{"$f":"IF(COLUMN()>=INDIRECT(AQ11),IF(COLUMN()<=INDIRECT(AR11),INDIRECT(AS11),\"\"),\"\")","v":{"$error":"#N/A"}},{"$f":"IF(COLUMN()>=INDIRECT(AQ11),IF(COLUMN()<=INDIRECT(AR11),INDIRECT(AS11),\"\"),\"\")","v":{"$error":"#N/A"}},{"$f":"IF(COLUMN()>=INDIRECT(AQ11),IF(COLUMN()<=INDIRECT(AR11),INDIRECT(AS11),\"\"),\"\")","v":{"$error":"#N/A"}},{"$f":"IF(COLUMN()>=INDIRECT(AQ11),IF(COLUMN()<=INDIRECT(AR11),INDIRECT(AS11),\"\"),\"\")","v":{"$error":"#N/A"}},{"$f":"IF(COLUMN()>=INDIRECT(AQ11),IF(COLUMN()<=INDIRECT(AR11),INDIRECT(AS11),\"\"),\"\")","v":{"$error":"#N/A"}},{"$f":"IF(COLUMN()>=INDIRECT(AQ11),IF(COLUMN()<=INDIRECT(AR11),INDIRECT(AS11),\"\"),\"\")","v":{"$error":"#N/A"}},{"$f":"IF(COLUMN()>=INDIRECT(AQ11),IF(COLUMN()<=INDIRECT(AR11),INDIRECT(AS11),\"\"),\"\")","v":{"$error":"#N/A"}},{"$f":"IF(COLUMN()>=INDIRECT(AQ11),IF(COLUMN()<=INDIRECT(AR11),INDIRECT(AS11),\"\"),\"\")","v":{"$error":"#N/A"}},{"$f":"IF(COLUMN()>=INDIRECT(AQ11),IF(COLUMN()<=INDIRECT(AR11),INDIRECT(AS11),\"\"),\"\")","v":{"$error":"#N/A"}},{"$f":"IF(COLUMN()>=INDIRECT(AQ11),IF(COLUMN()<=INDIRECT(AR11),INDIRECT(AS11),\"\"),\"\")","v":{"$error":"#N/A"}},{"$f":"IF(COLUMN()>=INDIRECT(AQ11),IF(COLUMN()<=INDIRECT(AR11),INDIRECT(AS11),\"\"),\"\")","v":{"$error":"#N/A"}},{"$f":"IF(COLUMN()>=INDIRECT(AQ11),IF(COLUMN()<=INDIRECT(AR11),INDIRECT(AS11),\"\"),\"\")","v":{"$error":"#N/A"}},{"$f":"IF(COLUMN()>=INDIRECT(AQ11),IF(COLUMN()<=INDIRECT(AR11),INDIRECT(AS11),\"\"),\"\")","v":{"$error":"#N/A"}},null,{"$f":"CONCATENATE(\"'\",SUBSTITUTE(SUBSTITUTE(SUBSTITUTE(MID(CELL(\"direccion\",'ETAPA III.a'!M$1),FIND(\"]\",CELL(\"direccion\",'ETAPA III.a'!M$1))+1,LEN(CELL(\"direccion\",'ETAPA III.a'!M$1))),\"$\",\"\"),1,MATCH($A11,'ETAPA III.a'!$K:$K,0)),\"!\",\"!$\"))","v":"'ETAPA III.a'!$M6"},{"$f":"CONCATENATE(\"'\",SUBSTITUTE(SUBSTITUTE(SUBSTITUTE(MID(CELL(\"direccion\",'ETAPA III.a'!N$1),FIND(\"]\",CELL(\"direccion\",'ETAPA III.a'!N$1))+1,LEN(CELL(\"direccion\",'ETAPA III.a'!N$1))),\"$\",\"\"),1,MATCH($A11,'ETAPA III.a'!$K:$K,0)),\"!\",\"!$\"))","v":"'ETAPA III.a'!$N6"},{"$f":"CONCATENATE(\"'\",SUBSTITUTE(SUBSTITUTE(SUBSTITUTE(MID(CELL(\"direccion\",'ETAPA III.a'!L$1),FIND(\"]\",CELL(\"direccion\",'ETAPA III.a'!L$1))+1,LEN(CELL(\"direccion\",'ETAPA III.a'!L$1))),\"$\",\"\"),1,MATCH($A11,'ETAPA III.a'!$K:$K,0)),\"!\",\"!$\"))","v":"'ETAPA III.a'!$L6"}]
[2,{"$f":"IF(COLUMN()>=INDIRECT(AQ12),IF(COLUMN()<=INDIRECT(AR12),INDIRECT(AS12),\"\"),\"\")","v":{"$error":"#N/A"}},{"$f":"IF(COLUMN()>=INDIRECT(AQ12),IF(COLUMN()<=INDIRECT(AR12),INDIRECT(AS12),\"\"),\"\")","v":{"$error":"#N/A"}},{"$f":"IF(COLUMN()>=INDIRECT(AQ12),IF(COLUMN()<=INDIRECT(AR12),INDIRECT(AS12),\"\"),\"\")","v":{"$error":"#N/A"}},{"$f":"IF(COLUMN()>=INDIRECT(AQ12),IF(COLUMN()<=INDIRECT(AR12),INDIRECT(AS12),\"\"),\"\")","v":{"$error":"#N/A"}},{"$f":"IF(COLUMN()>=INDIRECT(AQ12),IF(COLUMN()<=INDIRECT(AR12),INDIRECT(AS12),\"\"),\"\")","v":{"$error":"#N/A"}},{"$f":"IF(COLUMN()>=INDIRECT(AQ12),IF(COLUMN()<=INDIRECT(AR12),INDIRECT(AS12),\"\"),\"\")","v":{"$error":"#N/A"}},{"$f":"IF(COLUMN()>=INDIRECT(AQ12),IF(COLUMN()<=INDIRECT(AR12),INDIRECT(AS12),\"\"),\"\")","v":{"$error":"#N/A"}},{"$f":"IF(COLUMN()>=INDIRECT(AQ12),IF(COLUMN()<=INDIRECT(AR12),INDIRECT(AS12),\"\"),\"\")","v":{"$error":"#N/A"}},{"$f":"IF(COLUMN()>=INDIRECT(AQ12),IF(COLUMN()<=INDIRECT(AR12),INDIRECT(AS12),\"\"),\"\")","v":{"$error":"#N/A"}},{"$f":"IF(COLUMN()>=INDIRECT(AQ12),IF(COLUMN()<=INDIRECT(AR12),INDIRECT(AS12),\"\"),\"\")","v":{"$error":"#N/A"}},{"$f":"IF(COLUMN()>=INDIRECT(AQ12),IF(COLUMN()<=INDIRECT(AR12),INDIRECT(AS12),\"\"),\"\")","v":{"$error":"#N/A"}},{"$f":"IF(COLUMN()>=INDIRECT(AQ12),IF(COLUMN()<=INDIRECT(AR12),INDIRECT(AS12),\"\"),\"\")","v":{"$error":"#N/A"}},{"$f":"IF(COLUMN()>=INDIRECT(AQ12),IF(COLUMN()<=INDIRECT(AR12),INDIRECT(AS12),\"\"),\"\")","v":{"$error":"#N/A"}},{"$f":"IF(COLUMN()>=INDIRECT(AQ12),IF(COLUMN()<=INDIRECT(AR12),INDIRECT(AS12),\"\"),\"\")","v":{"$error":"#N/A"}},{"$f":"IF(COLUMN()>=INDIRECT(AQ12),IF(COLUMN()<=INDIRECT(AR12),INDIRECT(AS12),\"\"),\"\")","v":{"$error":"#N/A"}},{"$f":"IF(COLUMN()>=INDIRECT(AQ12),IF(COLUMN()<=INDIRECT(AR12),INDIRECT(AS12),\"\"),\"\")","v":{"$error":"#N/A"}},{"$f":"IF(COLUMN()>=INDIRECT(AQ12),IF(COLUMN()<=INDIRECT(AR12),INDIRECT(AS12),\"\"),\"\")","v":{"$error":"#N/A"}},{"$f":"IF(COLUMN()>=INDIRECT(AQ12),IF(COLUMN()<=INDIRECT(AR12),INDIRECT(AS12),\"\"),\"\")","v":{"$error":"#N/A"}},{"$f":"IF(COLUMN()>=INDIRECT(AQ12),IF(COLUMN()<=INDIRECT(AR12),INDIRECT(AS12),\"\"),\"\")","v":{"$error":"#N/A"}},{"$f":"IF(COLUMN()>=INDIRECT(AQ12),IF(COLUMN()<=INDIRECT(AR12),INDIRECT(AS12),\"\"),\"\")","v":{"$error":"#N/A"}},{"$f":"IF(COLUMN()>=INDIRECT(AQ12),IF(COLUMN()<=INDIRECT(AR12),INDIRECT(AS12),\"\"),\"\")","v":{"$error":"#N/A"}},{"$f":"IF(COLUMN()>=INDIRECT(AQ12),IF(COLUMN()<=INDIRECT(AR12),INDIRECT(AS12),\"\"),\"\")","v":{"$error":"#N/A"}},{"$f":"IF(COLUMN()>=INDIRECT(AQ12),IF(COLUMN()<=INDIRECT(AR12),INDIRECT(AS12),\"\"),\"\")","v":{"$error":"#N/A"}},{"$f":"IF(COLUMN()>=INDIRECT(AQ12),IF(COLUMN()<=INDIRECT(AR12),INDIRECT(AS12),\"\"),\"\")","v":{"$error":"#N/A"}},{"$f":"IF(COLUMN()>=INDIRECT(AQ12),IF(COLUMN()<=INDIRECT(AR12),INDIRECT(AS12),\"\"),\"\")","v":{"$error":"#N/A"}},{"$f":"IF(COLUMN()>=INDIRECT(AQ12),IF(COLUMN()<=INDIRECT(AR12),INDIRECT(AS12),\"\"),\"\")","v":{"$error":"#N/A"}},{"$f":"IF(COLUMN()>=INDIRECT(AQ12),IF(COLUMN()<=INDIRECT(AR12),INDIRECT(AS12),\"\"),\"\")","v":{"$error":"#N/A"}},{"$f":"IF(COLUMN()>=INDIRECT(AQ12),IF(COLUMN()<=INDIRECT(AR12),INDIRECT(AS12),\"\"),\"\")","v":{"$error":"#N/A"}},{"$f":"IF(COLUMN()>=INDIRECT(AQ12),IF(COLUMN()<=INDIRECT(AR12),INDIRECT(AS12),\"\"),\"\")","v":{"$error":"#N/A"}},{"$f":"IF(COLUMN()>=INDIRECT(AQ12),IF(COLUMN()<=INDIRECT(AR12),INDIRECT(AS12),\"\"),\"\")","v":{"$error":"#N/A"}},{"$f":"IF(COLUMN()>=INDIRECT(AQ12),IF(COLUMN()<=INDIRECT(AR12),INDIRECT(AS12),\"\"),\"\")","v":{"$error":"#N/A"}},{"$f":"IF(COLUMN()>=INDIRECT(AQ12),IF(COLUMN()<=INDIRECT(AR12),INDIRECT(AS12),\"\"),\"\")","v":{"$error":"#N/A"}},{"$f":"IF(COLUMN()>=INDIRECT(AQ12),IF(COLUMN()<=INDIRECT(AR12),INDIRECT(AS12),\"\"),\"\")","v":{"$error":"#N/A"}},{"$f":"IF(COLUMN()>=INDIRECT(AQ12),IF(COLUMN()<=INDIRECT(AR12),INDIRECT(AS12),\"\"),\"\")","v":{"$error":"#N/A"}},{"$f":"IF(COLUMN()>=INDIRECT(AQ12),IF(COLUMN()<=INDIRECT(AR12),INDIRECT(AS12),\"\"),\"\")","v":{"$error":"#N/A"}},{"$f":"IF(COLUMN()>=INDIRECT(AQ12),IF(COLUMN()<=INDIRECT(AR12),INDIRECT(AS12),\"\"),\"\")","v":{"$error":"#N/A"}},{"$f":"IF(COLUMN()>=INDIRECT(AQ12),IF(COLUMN()<=INDIRECT(AR12),INDIRECT(AS12),\"\"),\"\")","v":{"$error":"#N/A"}},{"$f":"IF(COLUMN()>=INDIRECT(AQ12),IF(COLUMN()<=INDIRECT(AR12),INDIRECT(AS12),\"\"),\"\")","v":{"$error":"#N/A"}},{"$f":"IF(COLUMN()>=INDIRECT(AQ12),IF(COLUMN()<=INDIRECT(AR12),INDIRECT(AS12),\"\"),\"\")","v":{"$error":"#N/A"}},{"$f":"IF(COLUMN()>=INDIRECT(AQ12),IF(COLUMN()<=INDIRECT(AR12),INDIRECT(AS12),\"\"),\"\")","v":{"$error":"#N/A"}},null,{"$f":"CONCATENATE(\"'\",SUBSTITUTE(SUBSTITUTE(SUBSTITUTE(MID(CELL(\"direccion\",'ETAPA III.a'!M$1),FIND(\"]\",CELL(\"direccion\",'ETAPA III.a'!M$1))+1,LEN(CELL(\"direccion\",'ETAPA III.a'!M$1))),\"$\",\"\"),1,MATCH($A12,'ETAPA III.a'!$K:$K,0)),\"!\",\"!$\"))","v":"'ETAPA III.a'!$M13"},{"$f":"CONCATENATE(\"'\",SUBSTITUTE(SUBSTITUTE(SUBSTITUTE(MID(CELL(\"direccion\",'ETAPA III.a'!N$1),FIND(\"]\",CELL(\"direccion\",'ETAPA III.a'!N$1))+1,LEN(CELL(\"direccion\",'ETAPA III.a'!N$1))),\"$\",\"\"),1,MATCH($A12,'ETAPA III.a'!$K:$K,0)),\"!\",\"!$\"))","v":"'ETAPA III.a'!$N13"},{"$f":"CONCATENATE(\"'\",SUBSTITUTE(SUBSTITUTE(SUBSTITUTE(MID(CELL(\"direccion\",'ETAPA III.a'!L$1),FIND(\"]\",CELL(\"direccion\",'ETAPA III.a'!L$1))+1,LEN(CELL(\"direccion\",'ETAPA III.a'!L$1))),\"$\",\"\"),1,MATCH($A12,'ETAPA III.a'!$K:$K,0)),\"!\",\"!$\"))","v":"'ETAPA III.a'!$L13"}]
[3,{"$f":"IF(COLUMN()>=INDIRECT(AQ13),IF(COLUMN()<=INDIRECT(AR13),INDIRECT(AS13),\"\"),\"\")","v":{"$error":"#N/A"}},{"$f":"IF(COLUMN()>=INDIRECT(AQ13),IF(COLUMN()<=INDIRECT(AR13),INDIRECT(AS13),\"\"),\"\")","v":{"$error":"#N/A"}},{"$f":"IF(COLUMN()>=INDIRECT(AQ13),IF(COLUMN()<=INDIRECT(AR13),INDIRECT(AS13),\"\"),\"\")","v":{"$error":"#N/A"}},{"$f":"IF(COLUMN()>=INDIRECT(AQ13),IF(COLUMN()<=INDIRECT(AR13),INDIRECT(AS13),\"\"),\"\")","v":{"$error":"#N/A"}},{"$f":"IF(COLUMN()>=INDIRECT(AQ13),IF(COLUMN()<=INDIRECT(AR13),INDIRECT(AS13),\"\"),\"\")","v":{"$error":"#N/A"}},{"$f":"IF(COLUMN()>=INDIRECT(AQ13),IF(COLUMN()<=INDIRECT(AR13),INDIRECT(AS13),\"\"),\"\")","v":{"$error":"#N/A"}},{"$f":"IF(COLUMN()>=INDIRECT(AQ13),IF(COLUMN()<=INDIRECT(AR13),INDIRECT(AS13),\"\"),\"\")","v":{"$error":"#N/A"}},{"$f":"IF(COLUMN()>=INDIRECT(AQ13),IF(COLUMN()<=INDIRECT(AR13),INDIRECT(AS13),\"\"),\"\")","v":{"$error":"#N/A"}},{"$f":"IF(COLUMN()>=INDIRECT(AQ13),IF(COLUMN()<=INDIRECT(AR13),INDIRECT(AS13),\"\"),\"\")","v":{"$error":"#N/A"}},{"$f":"IF(COLUMN()>=INDIRECT(AQ13),IF(COLUMN()<=INDIRECT(AR13),INDIRECT(AS13),\"\"),\"\")","v":{"$error":"#N/A"}},{"$f":"IF(COLUMN()>=INDIRECT(AQ13),IF(COLUMN()<=INDIRECT(AR13),INDIRECT(AS13),\"\"),\"\")","v":{"$error":"#N/A"}},{"$f":"IF(COLUMN()>=INDIRECT(AQ13),IF(COLUMN()<=INDIRECT(AR13),INDIRECT(AS13),\"\"),\"\")","v":{"$error":"#N/A"}},{"$f":"IF(COLUMN()>=INDIRECT(AQ13),IF(COLUMN()<=INDIRECT(AR13),INDIRECT(AS13),\"\"),\"\")","v":{"$error":"#N/A"}},{"$f":"IF(COLUMN()>=INDIRECT(AQ13),IF(COLUMN()<=INDIRECT(AR13),INDIRECT(AS13),\"\"),\"\")","v":{"$error":"#N/A"}},{"$f":"IF(COLUMN()>=INDIRECT(AQ13),IF(COLUMN()<=INDIRECT(AR13),INDIRECT(AS13),\"\"),\"\")","v":{"$error":"#N/A"}},{"$f":"IF(COLUMN()>=INDIRECT(AQ13),IF(COLUMN()<=INDIRECT(AR13),INDIRECT(AS13),\"\"),\"\")","v":{"$error":"#N/A"}},{"$f":"IF(COLUMN()>=INDIRECT(AQ13),IF(COLUMN()<=INDIRECT(AR13),INDIRECT(AS13),\"\"),\"\")","v":{"$error":"#N/A"}},{"$f":"IF(COLUMN()>=INDIRECT(AQ13),IF(COLUMN()<=INDIRECT(AR13),INDIRECT(AS13),\"\"),\"\")","v":{"$error":"#N/A"}},{"$f":"IF(COLUMN()>=INDIRECT(AQ13),IF(COLUMN()<=INDIRECT(AR13),INDIRECT(AS13),\"\"),\"\")","v":{"$error":"#N/A"}},{"$f":"IF(COLUMN()>=INDIRECT(AQ13),IF(COLUMN()<=INDIRECT(AR13),INDIRECT(AS13),\"\"),\"\")","v":{"$error":"#N/A"}},{"$f":"IF(COLUMN()>=INDIRECT(AQ13),IF(COLUMN()<=INDIRECT(AR13),INDIRECT(AS13),\"\"),\"\")","v":{"$error":"#N/A"}},{"$f":"IF(COLUMN()>=INDIRECT(AQ13),IF(COLUMN()<=INDIRECT(AR13),INDIRECT(AS13),\"\"),\"\")","v":{"$error":"#N/A"}},{"$f":"IF(COLUMN()>=INDIRECT(AQ13),IF(COLUMN()<=INDIRECT(AR13),INDIRECT(AS13),\"\"),\"\")","v":{"$error":"#N/A"}},{"$f":"IF(COLUMN()>=INDIRECT(AQ13),IF(COLUMN()<=INDIRECT(AR13),INDIRECT(AS13),\"\"),\"\")","v":{"$error":"#N/A"}},{"$f":"IF(COLUMN()>=INDIRECT(AQ13),IF(COLUMN()<=INDIRECT(AR13),INDIRECT(AS13),\"\"),\"\")","v":{"$error":"#N/A"}},{"$f":"IF(COLUMN()>=INDIRECT(AQ13),IF(COLUMN()<=INDIRECT(AR13),INDIRECT(AS13),\"\"),\"\")","v":{"$error":"#N/A"}},{"$f":"IF(COLUMN()>=INDIRECT(AQ13),IF(COLUMN()<=INDIRECT(AR13),INDIRECT(AS13),\"\"),\"\")","v":{"$error":"#N/A"}},{"$f":"IF(COLUMN()>=INDIRECT(AQ13),IF(COLUMN()<=INDIRECT(AR13),INDIRECT(AS13),\"\"),\"\")","v":{"$error":"#N/A"}},{"$f":"IF(COLUMN()>=INDIRECT(AQ13),IF(COLUMN()<=INDIRECT(AR13),INDIRECT(AS13),\"\"),\"\")","v":{"$error":"#N/A"}},{"$f":"IF(COLUMN()>=INDIRECT(AQ13),IF(COLUMN()<=INDIRECT(AR13),INDIRECT(AS13),\"\"),\"\")","v":{"$error":"#N/A"}},{"$f":"IF(COLUMN()>=INDIRECT(AQ13),IF(COLUMN()<=INDIRECT(AR13),INDIRECT(AS13),\"\"),\"\")","v":{"$error":"#N/A"}},{"$f":"IF(COLUMN()>=INDIRECT(AQ13),IF(COLUMN()<=INDIRECT(AR13),INDIRECT(AS13),\"\"),\"\")","v":{"$error":"#N/A"}},{"$f":"IF(COLUMN()>=INDIRECT(AQ13),IF(COLUMN()<=INDIRECT(AR13),INDIRECT(AS13),\"\"),\"\")","v":{"$error":"#N/A"}},{"$f":"IF(COLUMN()>=INDIRECT(AQ13),IF(COLUMN()<=INDIRECT(AR13),INDIRECT(AS13),\"\"),\"\")","v":{"$error":"#N/A"}},{"$f":"IF(COLUMN()>=INDIRECT(AQ13),IF(COLUMN()<=INDIRECT(AR13),INDIRECT(AS13),\"\"),\"\")","v":{"$error":"#N/A"}},{"$f":"IF(COLUMN()>=INDIRECT(AQ13),IF(COLUMN()<=INDIRECT(AR13),INDIRECT(AS13),\"\"),\"\")","v":{"$error":"#N/A"}},{"$f":"IF(COLUMN()>=INDIRECT(AQ13),IF(COLUMN()<=INDIRECT(AR13),INDIRECT(AS13),\"\"),\"\")","v":{"$error":"#N/A"}},{"$f":"IF(COLUMN()>=INDIRECT(AQ13),IF(COLUMN()<=INDIRECT(AR13),INDIRECT(AS13),\"\"),\"\")","v":{"$error":"#N/A"}},{"$f":"IF(COLUMN()>=INDIRECT(AQ13),IF(COLUMN()<=INDIRECT(AR13),INDIRECT(AS13),\"\"),\"\")","v":{"$error":"#N/A"}},{"$f":"IF(COLUMN()>=INDIRECT(AQ13),IF(COLUMN()<=INDIRECT(AR13),INDIRECT(AS13),\"\"),\"\")","v":{"$error":"#N/A"}},null,{"$f":"CONCATENATE(\"'\",SUBSTITUTE(SUBSTITUTE(SUBSTITUTE(MID(CELL(\"direccion\",'ETAPA III.a'!M$1),FIND(\"]\",CELL(\"direccion\",'ETAPA III.a'!M$1))+1,LEN(CELL(\"direccion\",'ETAPA III.a'!M$1))),\"$\",\"\"),1,MATCH($A13,'ETAPA III.a'!$K:$K,0)),\"!\",\"!$\"))","v":"'ETAPA III.a'!$M20"},{"$f":"CONCATENATE(\"'\",SUBSTITUTE(SUBSTITUTE(SUBSTITUTE(MID(CELL(\"direccion\",'ETAPA III.a'!N$1),FIND(\"]\",CELL(\"direccion\",'ETAPA III.a'!N$1))+1,LEN(CELL(\"direccion\",'ETAPA III.a'!N$1))),\"$\",\"\"),1,MATCH($A13,'ETAPA III.a'!$K:$K,0)),\"!\",\"!$\"))","v":"'ETAPA III.a'!$N20"},{"$f":"CONCATENATE(\"'\",SUBSTITUTE(SUBSTITUTE(SUBSTITUTE(MID(CELL(\"direccion\",'ETAPA III.a'!L$1),FIND(\"]\",CELL(\"direccion\",'ETAPA III.a'!L$1))+1,LEN(CELL(\"direccion\",'ETAPA III.a'!L$1))),\"$\",\"\"),1,MATCH($A13,'ETAPA III.a'!$K:$K,0)),\"!\",\"!$\"))","v":"'ETAPA III.a'!$L20"}]
[4,{"$f":"IF(COLUMN()>=INDIRECT(AQ14),IF(COLUMN()<=INDIRECT(AR14),INDIRECT(AS14),\"\"),\"\")","v":{"$error":"#N/A"}},{"$f":"IF(COLUMN()>=INDIRECT(AQ14),IF(COLUMN()<=INDIRECT(AR14),INDIRECT(AS14),\"\"),\"\")","v":{"$error":"#N/A"}},{"$f":"IF(COLUMN()>=INDIRECT(AQ14),IF(COLUMN()<=INDIRECT(AR14),INDIRECT(AS14),\"\"),\"\")","v":{"$error":"#N/A"}},{"$f":"IF(COLUMN()>=INDIRECT(AQ14),IF(COLUMN()<=INDIRECT(AR14),INDIRECT(AS14),\"\"),\"\")","v":{"$error":"#N/A"}},{"$f":"IF(COLUMN()>=INDIRECT(AQ14),IF(COLUMN()<=INDIRECT(AR14),INDIRECT(AS14),\"\"),\"\")","v":{"$error":"#N/A"}},{"$f":"IF(COLUMN()>=INDIRECT(AQ14),IF(COLUMN()<=INDIRECT(AR14),INDIRECT(AS14),\"\"),\"\")","v":{"$error":"#N/A"}},{"$f":"IF(COLUMN()>=INDIRECT(AQ14),IF(COLUMN()<=INDIRECT(AR14),INDIRECT(AS14),\"\"),\"\")","v":{"$error":"#N/A"}},{"$f":"IF(COLUMN()>=INDIRECT(AQ14),IF(COLUMN()<=INDIRECT(AR14),INDIRECT(AS14),\"\"),\"\")","v":{"$error":"#N/A"}},{"$f":"IF(COLUMN()>=INDIRECT(AQ14),IF(COLUMN()<=INDIRECT(AR14),INDIRECT(AS14),\"\"),\"\")","v":{"$error":"#N/A"}},{"$f":"IF(COLUMN()>=INDIRECT(AQ14),IF(COLUMN()<=INDIRECT(AR14),INDIRECT(AS14),\"\"),\"\")","v":{"$error":"#N/A"}},{"$f":"IF(COLUMN()>=INDIRECT(AQ14),IF(COLUMN()<=INDIRECT(AR14),INDIRECT(AS14),\"\"),\"\")","v":{"$error":"#N/A"}},{"$f":"IF(COLUMN()>=INDIRECT(AQ14),IF(COLUMN()<=INDIRECT(AR14),INDIRECT(AS14),\"\"),\"\")","v":{"$error":"#N/A"}},{"$f":"IF(COLUMN()>=INDIRECT(AQ14),IF(COLUMN()<=INDIRECT(AR14),INDIRECT(AS14),\"\"),\"\")","v":{"$error":"#N/A"}},{"$f":"IF(COLUMN()>=INDIRECT(AQ14),IF(COLUMN()<=INDIRECT(AR14),INDIRECT(AS14),\"\"),\"\")","v":{"$error":"#N/A"}},{"$f":"IF(COLUMN()>=INDIRECT(AQ14),IF(COLUMN()<=INDIRECT(AR14),INDIRECT(AS14),\"\"),\"\")","v":{"$error":"#N/A"}},{"$f":"IF(COLUMN()>=INDIRECT(AQ14),IF(COLUMN()<=INDIRECT(AR14),INDIRECT(AS14),\"\"),\"\")","v":{"$error":"#N/A"}},{"$f":"IF(COLUMN()>=INDIRECT(AQ14),IF(COLUMN()<=INDIRECT(AR14),INDIRECT(AS14),\"\"),\"\")","v":{"$error":"#N/A"}},{"$f":"IF(COLUMN()>=INDIRECT(AQ14),IF(COLUMN()<=INDIRECT(AR14),INDIRECT(AS14),\"\"),\"\")","v":{"$error":"#N/A"}},{"$f":"IF(COLUMN()>=INDIRECT(AQ14),IF(COLUMN()<=INDIRECT(AR14),INDIRECT(AS14),\"\"),\"\")","v":{"$error":"#N/A"}},{"$f":"IF(COLUMN()>=INDIRECT(AQ14),IF(COLUMN()<=INDIRECT(AR14),INDIRECT(AS14),\"\"),\"\")","v":{"$error":"#N/A"}},{"$f":"IF(COLUMN()>=INDIRECT(AQ14),IF(COLUMN()<=INDIRECT(AR14),INDIRECT(AS14),\"\"),\"\")","v":{"$error":"#N/A"}},{"$f":"IF(COLUMN()>=INDIRECT(AQ14),IF(COLUMN()<=INDIRECT(AR14),INDIRECT(AS14),\"\"),\"\")","v":{"$error":"#N/A"}},{"$f":"IF(COLUMN()>=INDIRECT(AQ14),IF(COLUMN()<=INDIRECT(AR14),INDIRECT(AS14),\"\"),\"\")","v":{"$error":"#N/A"}},{"$f":"IF(COLUMN()>=INDIRECT(AQ14),IF(COLUMN()<=INDIRECT(AR14),INDIRECT(AS14),\"\"),\"\")","v":{"$error":"#N/A"}},{"$f":"IF(COLUMN()>=INDIRECT(AQ14),IF(COLUMN()<=INDIRECT(AR14),INDIRECT(AS14),\"\"),\"\")","v":{"$error":"#N/A"}},{"$f":"IF(COLUMN()>=INDIRECT(AQ14),IF(COLUMN()<=INDIRECT(AR14),INDIRECT(AS14),\"\"),\"\")","v":{"$error":"#N/A"}},{"$f":"IF(COLUMN()>=INDIRECT(AQ14),IF(COLUMN()<=INDIRECT(AR14),INDIRECT(AS14),\"\"),\"\")","v":{"$error":"#N/A"}},{"$f":"IF(COLUMN()>=INDIRECT(AQ14),IF(COLUMN()<=INDIRECT(AR14),INDIRECT(AS14),\"\"),\"\")","v":{"$error":"#N/A"}},{"$f":"IF(COLUMN()>=INDIRECT(AQ14),IF(COLUMN()<=INDIRECT(AR14),INDIRECT(AS14),\"\"),\"\")","v":{"$error":"#N/A"}},{"$f":"IF(COLUMN()>=INDIRECT(AQ14),IF(COLUMN()<=INDIRECT(AR14),INDIRECT(AS14),\"\"),\"\")","v":{"$error":"#N/A"}},{"$f":"IF(COLUMN()>=INDIRECT(AQ14),IF(COLUMN()<=INDIRECT(AR14),INDIRECT(AS14),\"\"),\"\")","v":{"$error":"#N/A"}},{"$f":"IF(COLUMN()>=INDIRECT(AQ14),IF(COLUMN()<=INDIRECT(AR14),INDIRECT(AS14),\"\"),\"\")","v":{"$error":"#N/A"}},{"$f":"IF(COLUMN()>=INDIRECT(AQ14),IF(COLUMN()<=INDIRECT(AR14),INDIRECT(AS14),\"\"),\"\")","v":{"$error":"#N/A"}},{"$f":"IF(COLUMN()>=INDIRECT(AQ14),IF(COLUMN()<=INDIRECT(AR14),INDIRECT(AS14),\"\"),\"\")","v":{"$error":"#N/A"}},{"$f":"IF(COLUMN()>=INDIRECT(AQ14),IF(COLUMN()<=INDIRECT(AR14),INDIRECT(AS14),\"\"),\"\")","v":{"$error":"#N/A"}},{"$f":"IF(COLUMN()>=INDIRECT(AQ14),IF(COLUMN()<=INDIRECT(AR14),INDIRECT(AS14),\"\"),\"\")","v":{"$error":"#N/A"}},{"$f":"IF(COLUMN()>=INDIRECT(AQ14),IF(COLUMN()<=INDIRECT(AR14),INDIRECT(AS14),\"\"),\"\")","v":{"$error":"#N/A"}},{"$f":"IF(COLUMN()>=INDIRECT(AQ14),IF(COLUMN()<=INDIRECT(AR14),INDIRECT(AS14),\"\"),\"\")","v":{"$error":"#N/A"}},{"$f":"IF(COLUMN()>=INDIRECT(AQ14),IF(COLUMN()<=INDIRECT(AR14),INDIRECT(AS14),\"\"),\"\")","v":{"$error":"#N/A"}},{"$f":"IF(COLUMN()>=INDIRECT(AQ14),IF(COLUMN()<=INDIRECT(AR14),INDIRECT(AS14),\"\"),\"\")","v":{"$error":"#N/A"}},null,{"$f":"CONCATENATE(\"'\",SUBSTITUTE(SUBSTITUTE(SUBSTITUTE(MID(CELL(\"direccion\",'ETAPA III.a'!M$1),FIND(\"]\",CELL(\"direccion\",'ETAPA III.a'!M$1))+1,LEN(CELL(\"direccion\",'ETAPA III.a'!M$1))),\"$\",\"\"),1,MATCH($A14,'ETAPA III.a'!$K:$K,0)),\"!\",\"!$\"))","v":"'ETAPA III.a'!$M27"},{"$f":"CONCATENATE(\"'\",SUBSTITUTE(SUBSTITUTE(SUBSTITUTE(MID(CELL(\"direccion\",'ETAPA III.a'!N$1),FIND(\"]\",CELL(\"direccion\",'ETAPA III.a'!N$1))+1,LEN(CELL(\"direccion\",'ETAPA III.a'!N$1))),\"$\",\"\"),1,MATCH($A14,'ETAPA III.a'!$K:$K,0)),\"!\",\"!$\"))","v":"'ETAPA III.a'!$N27"},{"$f":"CONCATENATE(\"'\",SUBSTITUTE(SUBSTITUTE(SUBSTITUTE(MID(CELL(\"direccion\",'ETAPA III.a'!L$1),FIND(\"]\",CELL(\"direccion\",'ETAPA III.a'!L$1))+1,LEN(CELL(\"direccion\",'ETAPA III.a'!L$1))),\"$\",\"\"),1,MATCH($A14,'ETAPA III.a'!$K:$K,0)),\"!\",\"!$\"))","v":"'ETAPA III.a'!$L27"}]
[5,{"$f":"IF(COLUMN()>=INDIRECT(AQ15),IF(COLUMN()<=INDIRECT(AR15),INDIRECT(AS15),\"\"),\"\")","v":{"$error":"#N/A"}},{"$f":"IF(COLUMN()>=INDIRECT(AQ15),IF(COLUMN()<=INDIRECT(AR15),INDIRECT(AS15),\"\"),\"\")","v":{"$error":"#N/A"}},{"$f":"IF(COLUMN()>=INDIRECT(AQ15),IF(COLUMN()<=INDIRECT(AR15),INDIRECT(AS15),\"\"),\"\")","v":{"$error":"#N/A"}},{"$f":"IF(COLUMN()>=INDIRECT(AQ15),IF(COLUMN()<=INDIRECT(AR15),INDIRECT(AS15),\"\"),\"\")","v":{"$error":"#N/A"}},{"$f":"IF(COLUMN()>=INDIRECT(AQ15),IF(COLUMN()<=INDIRECT(AR15),INDIRECT(AS15),\"\"),\"\")","v":{"$error":"#N/A"}},{"$f":"IF(COLUMN()>=INDIRECT(AQ15),IF(COLUMN()<=INDIRECT(AR15),INDIRECT(AS15),\"\"),\"\")","v":{"$error":"#N/A"}},{"$f":"IF(COLUMN()>=INDIRECT(AQ15),IF(COLUMN()<=INDIRECT(AR15),INDIRECT(AS15),\"\"),\"\")","v":{"$error":"#N/A"}},{"$f":"IF(COLUMN()>=INDIRECT(AQ15),IF(COLUMN()<=INDIRECT(AR15),INDIRECT(AS15),\"\"),\"\")","v":{"$error":"#N/A"}},{"$f":"IF(COLUMN()>=INDIRECT(AQ15),IF(COLUMN()<=INDIRECT(AR15),INDIRECT(AS15),\"\"),\"\")","v":{"$error":"#N/A"}},{"$f":"IF(COLUMN()>=INDIRECT(AQ15),IF(COLUMN()<=INDIRECT(AR15),INDIRECT(AS15),\"\"),\"\")","v":{"$error":"#N/A"}},{"$f":"IF(COLUMN()>=INDIRECT(AQ15),IF(COLUMN()<=INDIRECT(AR15),INDIRECT(AS15),\"\"),\"\")","v":{"$error":"#N/A"}},{"$f":"IF(COLUMN()>=INDIRECT(AQ15),IF(COLUMN()<=INDIRECT(AR15),INDIRECT(AS15),\"\"),\"\")","v":{"$error":"#N/A"}},{"$f":"IF(COLUMN()>=INDIRECT(AQ15),IF(COLUMN()<=INDIRECT(AR15),INDIRECT(AS15),\"\"),\"\")","v":{"$error":"#N/A"}},{"$f":"IF(COLUMN()>=INDIRECT(AQ15),IF(COLUMN()<=INDIRECT(AR15),INDIRECT(AS15),\"\"),\"\")","v":{"$error":"#N/A"}},{"$f":"IF(COLUMN()>=INDIRECT(AQ15),IF(COLUMN()<=INDIRECT(AR15),INDIRECT(AS15),\"\"),\"\")","v":{"$error":"#N/A"}},{"$f":"IF(COLUMN()>=INDIRECT(AQ15),IF(COLUMN()<=INDIRECT(AR15),INDIRECT(AS15),\"\"),\"\")","v":{"$error":"#N/A"}},{"$f":"IF(COLUMN()>=INDIRECT(AQ15),IF(COLUMN()<=INDIRECT(AR15),INDIRECT(AS15),\"\"),\"\")","v":{"$error":"#N/A"}},{"$f":"IF(COLUMN()>=INDIRECT(AQ15),IF(COLUMN()<=INDIRECT(AR15),INDIRECT(AS15),\"\"),\"\")","v":{"$error":"#N/A"}},{"$f":"IF(COLUMN()>=INDIRECT(AQ15),IF(COLUMN()<=INDIRECT(AR15),INDIRECT(AS15),\"\"),\"\")","v":{"$error":"#N/A"}},{"$f":"IF(COLUMN()>=INDIRECT(AQ15),IF(COLUMN()<=INDIRECT(AR15),INDIRECT(AS15),\"\"),\"\")","v":{"$error":"#N/A"}},{"$f":"IF(COLUMN()>=INDIRECT(AQ15),IF(COLUMN()<=INDIRECT(AR15),INDIRECT(AS15),\"\"),\"\")","v":{"$error":"#N/A"}},{"$f":"IF(COLUMN()>=INDIRECT(AQ15),IF(COLUMN()<=INDIRECT(AR15),INDIRECT(AS15),\"\"),\"\")","v":{"$error":"#N/A"}},{"$f":"IF(COLUMN()>=INDIRECT(AQ15),IF(COLUMN()<=INDIRECT(AR15),INDIRECT(AS15),\"\"),\"\")","v":{"$error":"#N/A"}},{"$f":"IF(COLUMN()>=INDIRECT(AQ15),IF(COLUMN()<=INDIRECT(AR15),INDIRECT(AS15),\"\"),\"\")","v":{"$error":"#N/A"}},{"$f":"IF(COLUMN()>=INDIRECT(AQ15),IF(COLUMN()<=INDIRECT(AR15),INDIRECT(AS15),\"\"),\"\")","v":{"$error":"#N/A"}},{"$f":"IF(COLUMN()>=INDIRECT(AQ15),IF(COLUMN()<=INDIRECT(AR15),INDIRECT(AS15),\"\"),\"\")","v":{"$error":"#N/A"}},{"$f":"IF(COLUMN()>=INDIRECT(AQ15),IF(COLUMN()<=INDIRECT(AR15),INDIRECT(AS15),\"\"),\"\")","v":{"$error":"#N/A"}},{"$f":"IF(COLUMN()>=INDIRECT(AQ15),IF(COLUMN()<=INDIRECT(AR15),INDIRECT(AS15),\"\"),\"\")","v":{"$error":"#N/A"}},{"$f":"IF(COLUMN()>=INDIRECT(AQ15),IF(COLUMN()<=INDIRECT(AR15),INDIRECT(AS15),\"\"),\"\")","v":{"$error":"#N/A"}},{"$f":"IF(COLUMN()>=INDIRECT(AQ15),IF(COLUMN()<=INDIRECT(AR15),INDIRECT(AS15),\"\"),\"\")","v":{"$error":"#N/A"}},{"$f":"IF(COLUMN()>=INDIRECT(AQ15),IF(COLUMN()<=INDIRECT(AR15),INDIRECT(AS15),\"\"),\"\")","v":{"$error":"#N/A"}},{"$f":"IF(COLUMN()>=INDIRECT(AQ15),IF(COLUMN()<=INDIRECT(AR15),INDIRECT(AS15),\"\"),\"\")","v":{"$error":"#N/A"}},{"$f":"IF(COLUMN()>=INDIRECT(AQ15),IF(COLUMN()<=INDIRECT(AR15),INDIRECT(AS15),\"\"),\"\")","v":{"$error":"#N/A"}},{"$f":"IF(COLUMN()>=INDIRECT(AQ15),IF(COLUMN()<=INDIRECT(AR15),INDIRECT(AS15),\"\"),\"\")","v":{"$error":"#N/A"}},{"$f":"IF(COLUMN()>=INDIRECT(AQ15),IF(COLUMN()<=INDIRECT(AR15),INDIRECT(AS15),\"\"),\"\")","v":{"$error":"#N/A"}},{"$f":"IF(COLUMN()>=INDIRECT(AQ15),IF(COLUMN()<=INDIRECT(AR15),INDIRECT(AS15),\"\"),\"\")","v":{"$error":"#N/A"}},{"$f":"IF(COLUMN()>=INDIRECT(AQ15),IF(COLUMN()<=INDIRECT(AR15),INDIRECT(AS15),\"\"),\"\")","v":{"$error":"#N/A"}},{"$f":"IF(COLUMN()>=INDIRECT(AQ15),IF(COLUMN()<=INDIRECT(AR15),INDIRECT(AS15),\"\"),\"\")","v":{"$error":"#N/A"}},{"$f":"IF(COLUMN()>=INDIRECT(AQ15),IF(COLUMN()<=INDIRECT(AR15),INDIRECT(AS15),\"\"),\"\")","v":{"$error":"#N/A"}},{"$f":"IF(COLUMN()>=INDIRECT(AQ15),IF(COLUMN()<=INDIRECT(AR15),INDIRECT(AS15),\"\"),\"\")","v":{"$error":"#N/A"}},null,{"$f":"CONCATENATE(\"'\",SUBSTITUTE(SUBSTITUTE(SUBSTITUTE(MID(CELL(\"direccion\",'ETAPA III.a'!M$1),FIND(\"]\",CELL(\"direccion\",'ETAPA III.a'!M$1))+1,LEN(CELL(\"direccion\",'ETAPA III.a'!M$1))),\"$\",\"\"),1,MATCH($A15,'ETAPA III.a'!$K:$K,0)),\"!\",\"!$\"))","v":"'ETAPA III.a'!$M34"},{"$f":"CONCATENATE(\"'\",SUBSTITUTE(SUBSTITUTE(SUBSTITUTE(MID(CELL(\"direccion\",'ETAPA III.a'!N$1),FIND(\"]\",CELL(\"direccion\",'ETAPA III.a'!N$1))+1,LEN(CELL(\"direccion\",'ETAPA III.a'!N$1))),\"$\",\"\"),1,MATCH($A15,'ETAPA III.a'!$K:$K,0)),\"!\",\"!$\"))","v":"'ETAPA III.a'!$N34"},{"$f":"CONCATENATE(\"'\",SUBSTITUTE(SUBSTITUTE(SUBSTITUTE(MID(CELL(\"direccion\",'ETAPA III.a'!L$1),FIND(\"]\",CELL(\"direccion\",'ETAPA III.a'!L$1))+1,LEN(CELL(\"direccion\",'ETAPA III.a'!L$1))),\"$\",\"\"),1,MATCH($A15,'ETAPA III.a'!$K:$K,0)),\"!\",\"!$\"))","v":"'ETAPA III.a'!$L34"}]
[6,{"$f":"IF(COLUMN()>=INDIRECT(AQ16),IF(COLUMN()<=INDIRECT(AR16),INDIRECT(AS16),\"\"),\"\")","v":{"$error":"#N/A"}},{"$f":"IF(COLUMN()>=INDIRECT(AQ16),IF(COLUMN()<=INDIRECT(AR16),INDIRECT(AS16),\"\"),\"\")","v":{"$error":"#N/A"}},{"$f":"IF(COLUMN()>=INDIRECT(AQ16),IF(COLUMN()<=INDIRECT(AR16),INDIRECT(AS16),\"\"),\"\")","v":{"$error":"#N/A"}},{"$f":"IF(COLUMN()>=INDIRECT(AQ16),IF(COLUMN()<=INDIRECT(AR16),INDIRECT(AS16),\"\"),\"\")","v":{"$error":"#N/A"}},{"$f":"IF(COLUMN()>=INDIRECT(AQ16),IF(COLUMN()<=INDIRECT(AR16),INDIRECT(AS16),\"\"),\"\")","v":{"$error":"#N/A"}},{"$f":"IF(COLUMN()>=INDIRECT(AQ16),IF(COLUMN()<=INDIRECT(AR16),INDIRECT(AS16),\"\"),\"\")","v":{"$error":"#N/A"}},{"$f":"IF(COLUMN()>=INDIRECT(AQ16),IF(COLUMN()<=INDIRECT(AR16),INDIRECT(AS16),\"\"),\"\")","v":{"$error":"#N/A"}},{"$f":"IF(COLUMN()>=INDIRECT(AQ16),IF(COLUMN()<=INDIRECT(AR16),INDIRECT(AS16),\"\"),\"\")","v":{"$error":"#N/A"}},{"$f":"IF(COLUMN()>=INDIRECT(AQ16),IF(COLUMN()<=INDIRECT(AR16),INDIRECT(AS16),\"\"),\"\")","v":{"$error":"#N/A"}},{"$f":"IF(COLUMN()>=INDIRECT(AQ16),IF(COLUMN()<=INDIRECT(AR16),INDIRECT(AS16),\"\"),\"\")","v":{"$error":"#N/A"}},{"$f":"IF(COLUMN()>=INDIRECT(AQ16),IF(COLUMN()<=INDIRECT(AR16),INDIRECT(AS16),\"\"),\"\")","v":{"$error":"#N/A"}},{"$f":"IF(COLUMN()>=INDIRECT(AQ16),IF(COLUMN()<=INDIRECT(AR16),INDIRECT(AS16),\"\"),\"\")","v":{"$error":"#N/A"}},{"$f":"IF(COLUMN()>=INDIRECT(AQ16),IF(COLUMN()<=INDIRECT(AR16),INDIRECT(AS16),\"\"),\"\")","v":{"$error":"#N/A"}},{"$f":"IF(COLUMN()>=INDIRECT(AQ16),IF(COLUMN()<=INDIRECT(AR16),INDIRECT(AS16),\"\"),\"\")","v":{"$error":"#N/A"}},{"$f":"IF(COLUMN()>=INDIRECT(AQ16),IF(COLUMN()<=INDIRECT(AR16),INDIRECT(AS16),\"\"),\"\")","v":{"$error":"#N/A"}},{"$f":"IF(COLUMN()>=INDIRECT(AQ16),IF(COLUMN()<=INDIRECT(AR16),INDIRECT(AS16),\"\"),\"\")","v":{"$error":"#N/A"}},{"$f":"IF(COLUMN()>=INDIRECT(AQ16),IF(COLUMN()<=INDIRECT(AR16),INDIRECT(AS16),\"\"),\"\")","v":{"$error":"#N/A"}},{"$f":"IF(COLUMN()>=INDIRECT(AQ16),IF(COLUMN()<=INDIRECT(AR16),INDIRECT(AS16),\"\"),\"\")","v":{"$error":"#N/A"}},{"$f":"IF(COLUMN()>=INDIRECT(AQ16),IF(COLUMN()<=INDIRECT(AR16),INDIRECT(AS16),\"\"),\"\")","v":{"$error":"#N/A"}},{"$f":"IF(COLUMN()>=INDIRECT(AQ16),IF(COLUMN()<=INDIRECT(AR16),INDIRECT(AS16),\"\"),\"\")","v":{"$error":"#N/A"}},{"$f":"IF(COLUMN()>=INDIRECT(AQ16),IF(COLUMN()<=INDIRECT(AR16),INDIRECT(AS16),\"\"),\"\")","v":{"$error":"#N/A"}},{"$f":"IF(COLUMN()>=INDIRECT(AQ16),IF(COLUMN()<=INDIRECT(AR16),INDIRECT(AS16),\"\"),\"\")","v":{"$error":"#N/A"}},{"$f":"IF(COLUMN()>=INDIRECT(AQ16),IF(COLUMN()<=INDIRECT(AR16),INDIRECT(AS16),\"\"),\"\")","v":{"$error":"#N/A"}},{"$f":"IF(COLUMN()>=INDIRECT(AQ16),IF(COLUMN()<=INDIRECT(AR16),INDIRECT(AS16),\"\"),\"\")","v":{"$error":"#N/A"}},{"$f":"IF(COLUMN()>=INDIRECT(AQ16),IF(COLUMN()<=INDIRECT(AR16),INDIRECT(AS16),\"\"),\"\")","v":{"$error":"#N/A"}},{"$f":"IF(COLUMN()>=INDIRECT(AQ16),IF(COLUMN()<=INDIRECT(AR16),INDIRECT(AS16),\"\"),\"\")","v":{"$error":"#N/A"}},{"$f":"IF(COLUMN()>=INDIRECT(AQ16),IF(COLUMN()<=INDIRECT(AR16),INDIRECT(AS16),\"\"),\"\")","v":{"$error":"#N/A"}},{"$f":"IF(COLUMN()>=INDIRECT(AQ16),IF(COLUMN()<=INDIRECT(AR16),INDIRECT(AS16),\"\"),\"\")","v":{"$error":"#N/A"}},{"$f":"IF(COLUMN()>=INDIRECT(AQ16),IF(COLUMN()<=INDIRECT(AR16),INDIRECT(AS16),\"\"),\"\")","v":{"$error":"#N/A"}},{"$f":"IF(COLUMN()>=INDIRECT(AQ16),IF(COLUMN()<=INDIRECT(AR16),INDIRECT(AS16),\"\"),\"\")","v":{"$error":"#N/A"}},{"$f":"IF(COLUMN()>=INDIRECT(AQ16),IF(COLUMN()<=INDIRECT(AR16),INDIRECT(AS16),\"\"),\"\")","v":{"$error":"#N/A"}},{"$f":"IF(COLUMN()>=INDIRECT(AQ16),IF(COLUMN()<=INDIRECT(AR16),INDIRECT(AS16),\"\"),\"\")","v":{"$error":"#N/A"}},{"$f":"IF(COLUMN()>=INDIRECT(AQ16),IF(COLUMN()<=INDIRECT(AR16),INDIRECT(AS16),\"\"),\"\")","v":{"$error":"#N/A"}},{"$f":"IF(COLUMN()>=INDIRECT(AQ16),IF(COLUMN()<=INDIRECT(AR16),INDIRECT(AS16),\"\"),\"\")","v":{"$error":"#N/A"}},{"$f":"IF(COLUMN()>=INDIRECT(AQ16),IF(COLUMN()<=INDIRECT(AR16),INDIRECT(AS16),\"\"),\"\")","v":{"$error":"#N/A"}},{"$f":"IF(COLUMN()>=INDIRECT(AQ16),IF(COLUMN()<=INDIRECT(AR16),INDIRECT(AS16),\"\"),\"\")","v":{"$error":"#N/A"}},{"$f":"IF(COLUMN()>=INDIRECT(AQ16),IF(COLUMN()<=INDIRECT(AR16),INDIRECT(AS16),\"\"),\"\")","v":{"$error":"#N/A"}},{"$f":"IF(COLUMN()>=INDIRECT(AQ16),IF(COLUMN()<=INDIRECT(AR16),INDIRECT(AS16),\"\"),\"\")","v":{"$error":"#N/A"}},{"$f":"IF(COLUMN()>=INDIRECT(AQ16),IF(COLUMN()<=INDIRECT(AR16),INDIRECT(AS16),\"\"),\"\")","v":{"$error":"#N/A"}},{"$f":"IF(COLUMN()>=INDIRECT(AQ16),IF(COLUMN()<=INDIRECT(AR16),INDIRECT(AS16),\"\"),\"\")","v":{"$error":"#N/A"}},null,{"$f":"CONCATENATE(\"'\",SUBSTITUTE(SUBSTITUTE(SUBSTITUTE(MID(CELL(\"direccion\",'ETAPA III.a'!M$1),FIND(\"]\",CELL(\"direccion\",'ETAPA III.a'!M$1))+1,LEN(CELL(\"direccion\",'ETAPA III.a'!M$1))),\"$\",\"\"),1,MATCH($A16,'ETAPA III.a'!$K:$K,0)),\"!\",\"!$\"))","v":"'ETAPA III.a'!$M41"},{"$f":"CONCATENATE(\"'\",SUBSTITUTE(SUBSTITUTE(SUBSTITUTE(MID(CELL(\"direccion\",'ETAPA III.a'!N$1),FIND(\"]\",CELL(\"direccion\",'ETAPA III.a'!N$1))+1,LEN(CELL(\"direccion\",'ETAPA III.a'!N$1))),\"$\",\"\"),1,MATCH($A16,'ETAPA III.a'!$K:$K,0)),\"!\",\"!$\"))","v":"'ETAPA III.a'!$N41"},{"$f":"CONCATENATE(\"'\",SUBSTITUTE(SUBSTITUTE(SUBSTITUTE(MID(CELL(\"direccion\",'ETAPA III.a'!L$1),FIND(\"]\",CELL(\"direccion\",'ETAPA III.a'!L$1))+1,LEN(CELL(\"direccion\",'ETAPA III.a'!L$1))),\"$\",\"\"),1,MATCH($A16,'ETAPA III.a'!$K:$K,0)),\"!\",\"!$\"))","v":"'ETAPA III.a'!$L41"}]
[7,{"$f":"IF(COLUMN()>=INDIRECT(AQ17),IF(COLUMN()<=INDIRECT(AR17),INDIRECT(AS17),\"\"),\"\")","v":{"$error":"#N/A"}},{"$f":"IF(COLUMN()>=INDIRECT(AQ17),IF(COLUMN()<=INDIRECT(AR17),INDIRECT(AS17),\"\"),\"\")","v":{"$error":"#N/A"}},{"$f":"IF(COLUMN()>=INDIRECT(AQ17),IF(COLUMN()<=INDIRECT(AR17),INDIRECT(AS17),\"\"),\"\")","v":{"$error":"#N/A"}},{"$f":"IF(COLUMN()>=INDIRECT(AQ17),IF(COLUMN()<=INDIRECT(AR17),INDIRECT(AS17),\"\"),\"\")","v":{"$error":"#N/A"}},{"$f":"IF(COLUMN()>=INDIRECT(AQ17),IF(COLUMN()<=INDIRECT(AR17),INDIRECT(AS17),\"\"),\"\")","v":{"$error":"#N/A"}},{"$f":"IF(COLUMN()>=INDIRECT(AQ17),IF(COLUMN()<=INDIRECT(AR17),INDIRECT(AS17),\"\"),\"\")","v":{"$error":"#N/A"}},{"$f":"IF(COLUMN()>=INDIRECT(AQ17),IF(COLUMN()<=INDIRECT(AR17),INDIRECT(AS17),\"\"),\"\")","v":{"$error":"#N/A"}},{"$f":"IF(COLUMN()>=INDIRECT(AQ17),IF(COLUMN()<=INDIRECT(AR17),INDIRECT(AS17),\"\"),\"\")","v":{"$error":"#N/A"}},{"$f":"IF(COLUMN()>=INDIRECT(AQ17),IF(COLUMN()<=INDIRECT(AR17),INDIRECT(AS17),\"\"),\"\")","v":{"$error":"#N/A"}},{"$f":"IF(COLUMN()>=INDIRECT(AQ17),IF(COLUMN()<=INDIRECT(AR17),INDIRECT(AS17),\"\"),\"\")","v":{"$error":"#N/A"}},{"$f":"IF(COLUMN()>=INDIRECT(AQ17),IF(COLUMN()<=INDIRECT(AR17),INDIRECT(AS17),\"\"),\"\")","v":{"$error":"#N/A"}},{"$f":"IF(COLUMN()>=INDIRECT(AQ17),IF(COLUMN()<=INDIRECT(AR17),INDIRECT(AS17),\"\"),\"\")","v":{"$error":"#N/A"}},{"$f":"IF(COLUMN()>=INDIRECT(AQ17),IF(COLUMN()<=INDIRECT(AR17),INDIRECT(AS17),\"\"),\"\")","v":{"$error":"#N/A"}},{"$f":"IF(COLUMN()>=INDIRECT(AQ17),IF(COLUMN()<=INDIRECT(AR17),INDIRECT(AS17),\"\"),\"\")","v":{"$error":"#N/A"}},{"$f":"IF(COLUMN()>=INDIRECT(AQ17),IF(COLUMN()<=INDIRECT(AR17),INDIRECT(AS17),\"\"),\"\")","v":{"$error":"#N/A"}},{"$f":"IF(COLUMN()>=INDIRECT(AQ17),IF(COLUMN()<=INDIRECT(AR17),INDIRECT(AS17),\"\"),\"\")","v":{"$error":"#N/A"}},{"$f":"IF(COLUMN()>=INDIRECT(AQ17),IF(COLUMN()<=INDIRECT(AR17),INDIRECT(AS17),\"\"),\"\")","v":{"$error":"#N/A"}},{"$f":"IF(COLUMN()>=INDIRECT(AQ17),IF(COLUMN()<=INDIRECT(AR17),INDIRECT(AS17),\"\"),\"\")","v":{"$error":"#N/A"}},{"$f":"IF(COLUMN()>=INDIRECT(AQ17),IF(COLUMN()<=INDIRECT(AR17),INDIRECT(AS17),\"\"),\"\")","v":{"$error":"#N/A"}},{"$f":"IF(COLUMN()>=INDIRECT(AQ17),IF(COLUMN()<=INDIRECT(AR17),INDIRECT(AS17),\"\"),\"\")","v":{"$error":"#N/A"}},{"$f":"IF(COLUMN()>=INDIRECT(AQ17),IF(COLUMN()<=INDIRECT(AR17),INDIRECT(AS17),\"\"),\"\")","v":{"$error":"#N/A"}},{"$f":"IF(COLUMN()>=INDIRECT(AQ17),IF(COLUMN()<=INDIRECT(AR17),INDIRECT(AS17),\"\"),\"\")","v":{"$error":"#N/A"}},{"$f":"IF(COLUMN()>=INDIRECT(AQ17),IF(COLUMN()<=INDIRECT(AR17),INDIRECT(AS17),\"\"),\"\")","v":{"$error":"#N/A"}},{"$f":"IF(COLUMN()>=INDIRECT(AQ17),IF(COLUMN()<=INDIRECT(AR17),INDIRECT(AS17),\"\"),\"\")","v":{"$error":"#N/A"}},{"$f":"IF(COLUMN()>=INDIRECT(AQ17),IF(COLUMN()<=INDIRECT(AR17),INDIRECT(AS17),\"\"),\"\")","v":{"$error":"#N/A"}},{"$f":"IF(COLUMN()>=INDIRECT(AQ17),IF(COLUMN()<=INDIRECT(AR17),INDIRECT(AS17),\"\"),\"\")","v":{"$error":"#N/A"}},{"$f":"IF(COLUMN()>=INDIRECT(AQ17),IF(COLUMN()<=INDIRECT(AR17),INDIRECT(AS17),\"\"),\"\")","v":{"$error":"#N/A"}},{"$f":"IF(COLUMN()>=INDIRECT(AQ17),IF(COLUMN()<=INDIRECT(AR17),INDIRECT(AS17),\"\"),\"\")","v":{"$error":"#N/A"}},{"$f":"IF(COLUMN()>=INDIRECT(AQ17),IF(COLUMN()<=INDIRECT(AR17),INDIRECT(AS17),\"\"),\"\")","v":{"$error":"#N/A"}},{"$f":"IF(COLUMN()>=INDIRECT(AQ17),IF(COLUMN()<=INDIRECT(AR17),INDIRECT(AS17),\"\"),\"\")","v":{"$error":"#N/A"}},{"$f":"IF(COLUMN()>=INDIRECT(AQ17),IF(COLUMN()<=INDIRECT(AR17),INDIRECT(AS17),\"\"),\"\")","v":{"$error":"#N/A"}},{"$f":"IF(COLUMN()>=INDIRECT(AQ17),IF(COLUMN()<=INDIRECT(AR17),INDIRECT(AS17),\"\"),\"\")","v":{"$error":"#N/A"}},{"$f":"IF(COLUMN()>=INDIRECT(AQ17),IF(COLUMN()<=INDIRECT(AR17),INDIRECT(AS17),\"\"),\"\")","v":{"$error":"#N/A"}},{"$f":"IF(COLUMN()>=INDIRECT(AQ17),IF(COLUMN()<=INDIRECT(AR17),INDIRECT(AS17),\"\"),\"\")","v":{"$error":"#N/A"}},{"$f":"IF(COLUMN()>=INDIRECT(AQ17),IF(COLUMN()<=INDIRECT(AR17),INDIRECT(AS17),\"\"),\"\")","v":{"$error":"#N/A"}},{"$f":"IF(COLUMN()>=INDIRECT(AQ17),IF(COLUMN()<=INDIRECT(AR17),INDIRECT(AS17),\"\"),\"\")","v":{"$error":"#N/A"}},{"$f":"IF(COLUMN()>=INDIRECT(AQ17),IF(COLUMN()<=INDIRECT(AR17),INDIRECT(AS17),\"\"),\"\")","v":{"$error":"#N/A"}},{"$f":"IF(COLUMN()>=INDIRECT(AQ17),IF(COLUMN()<=INDIRECT(AR17),INDIRECT(AS17),\"\"),\"\")","v":{"$error":"#N/A"}},{"$f":"IF(COLUMN()>=INDIRECT(AQ17),IF(COLUMN()<=INDIRECT(AR17),INDIRECT(AS17),\"\"),\"\")","v":{"$error":"#N/A"}},{"$f":"IF(COLUMN()>=INDIRECT(AQ17),IF(COLUMN()<=INDIRECT(AR17),INDIRECT(AS17),\"\"),\"\")","v":{"$error":"#N/A"}},null,{"$f":"CONCATENATE(\"'\",SUBSTITUTE(SUBSTITUTE(SUBSTITUTE(MID(CELL(\"direccion\",'ETAPA III.a'!M$1),FIND(\"]\",CELL(\"direccion\",'ETAPA III.a'!M$1))+1,LEN(CELL(\"direccion\",'ETAPA III.a'!M$1))),\"$\",\"\"),1,MATCH($A17,'ETAPA III.a'!$K:$K,0)),\"!\",\"!$\"))","v":"'ETAPA III.a'!$M51"},{"$f":"CONCATENATE(\"'\",SUBSTITUTE(SUBSTITUTE(SUBSTITUTE(MID(CELL(\"direccion\",'ETAPA III.a'!N$1),FIND(\"]\",CELL(\"direccion\",'ETAPA III.a'!N$1))+1,LEN(CELL(\"direccion\",'ETAPA III.a'!N$1))),\"$\",\"\"),1,MATCH($A17,'ETAPA III.a'!$K:$K,0)),\"!\",\"!$\"))","v":"'ETAPA III.a'!$N51"},{"$f":"CONCATENATE(\"'\",SUBSTITUTE(SUBSTITUTE(SUBSTITUTE(MID(CELL(\"direccion\",'ETAPA III.a'!L$1),FIND(\"]\",CELL(\"direccion\",'ETAPA III.a'!L$1))+1,LEN(CELL(\"direccion\",'ETAPA III.a'!L$1))),\"$\",\"\"),1,MATCH($A17,'ETAPA III.a'!$K:$K,0)),\"!\",\"!$\"))","v":"'ETAPA III.a'!$L51"}]
[8,{"$f":"IF(COLUMN()>=INDIRECT(AQ18),IF(COLUMN()<=INDIRECT(AR18),INDIRECT(AS18),\"\"),\"\")","v":{"$error":"#N/A"}},{"$f":"IF(COLUMN()>=INDIRECT(AQ18),IF(COLUMN()<=INDIRECT(AR18),INDIRECT(AS18),\"\"),\"\")","v":{"$error":"#N/A"}},{"$f":"IF(COLUMN()>=INDIRECT(AQ18),IF(COLUMN()<=INDIRECT(AR18),INDIRECT(AS18),\"\"),\"\")","v":{"$error":"#N/A"}},{"$f":"IF(COLUMN()>=INDIRECT(AQ18),IF(COLUMN()<=INDIRECT(AR18),INDIRECT(AS18),\"\"),\"\")","v":{"$error":"#N/A"}},{"$f":"IF(COLUMN()>=INDIRECT(AQ18),IF(COLUMN()<=INDIRECT(AR18),INDIRECT(AS18),\"\"),\"\")","v":{"$error":"#N/A"}},{"$f":"IF(COLUMN()>=INDIRECT(AQ18),IF(COLUMN()<=INDIRECT(AR18),INDIRECT(AS18),\"\"),\"\")","v":{"$error":"#N/A"}},{"$f":"IF(COLUMN()>=INDIRECT(AQ18),IF(COLUMN()<=INDIRECT(AR18),INDIRECT(AS18),\"\"),\"\")","v":{"$error":"#N/A"}},{"$f":"IF(COLUMN()>=INDIRECT(AQ18),IF(COLUMN()<=INDIRECT(AR18),INDIRECT(AS18),\"\"),\"\")","v":{"$error":"#N/A"}},{"$f":"IF(COLUMN()>=INDIRECT(AQ18),IF(COLUMN()<=INDIRECT(AR18),INDIRECT(AS18),\"\"),\"\")","v":{"$error":"#N/A"}},{"$f":"IF(COLUMN()>=INDIRECT(AQ18),IF(COLUMN()<=INDIRECT(AR18),INDIRECT(AS18),\"\"),\"\")","v":{"$error":"#N/A"}},{"$f":"IF(COLUMN()>=INDIRECT(AQ18),IF(COLUMN()<=INDIRECT(AR18),INDIRECT(AS18),\"\"),\"\")","v":{"$error":"#N/A"}},{"$f":"IF(COLUMN()>=INDIRECT(AQ18),IF(COLUMN()<=INDIRECT(AR18),INDIRECT(AS18),\"\"),\"\")","v":{"$error":"#N/A"}},{"$f":"IF(COLUMN()>=INDIRECT(AQ18),IF(COLUMN()<=INDIRECT(AR18),INDIRECT(AS18),\"\"),\"\")","v":{"$error":"#N/A"}},{"$f":"IF(COLUMN()>=INDIRECT(AQ18),IF(COLUMN()<=INDIRECT(AR18),INDIRECT(AS18),\"\"),\"\")","v":{"$error":"#N/A"}},{"$f":"IF(COLUMN()>=INDIRECT(AQ18),IF(COLUMN()<=INDIRECT(AR18),INDIRECT(AS18),\"\"),\"\")","v":{"$error":"#N/A"}},{"$f":"IF(COLUMN()>=INDIRECT(AQ18),IF(COLUMN()<=INDIRECT(AR18),INDIRECT(AS18),\"\"),\"\")","v":{"$error":"#N/A"}},{"$f":"IF(COLUMN()>=INDIRECT(AQ18),IF(COLUMN()<=INDIRECT(AR18),INDIRECT(AS18),\"\"),\"\")","v":{"$error":"#N/A"}},{"$f":"IF(COLUMN()>=INDIRECT(AQ18),IF(COLUMN()<=INDIRECT(AR18),INDIRECT(AS18),\"\"),\"\")","v":{"$error":"#N/A"}},{"$f":"IF(COLUMN()>=INDIRECT(AQ18),IF(COLUMN()<=INDIRECT(AR18),INDIRECT(AS18),\"\"),\"\")","v":{"$error":"#N/A"}},{"$f":"IF(COLUMN()>=INDIRECT(AQ18),IF(COLUMN()<=INDIRECT(AR18),INDIRECT(AS18),\"\"),\"\")","v":{"$error":"#N/A"}},{"$f":"IF(COLUMN()>=INDIRECT(AQ18),IF(COLUMN()<=INDIRECT(AR18),INDIRECT(AS18),\"\"),\"\")","v":{"$error":"#N/A"}},{"$f":"IF(COLUMN()>=INDIRECT(AQ18),IF(COLUMN()<=INDIRECT(AR18),INDIRECT(AS18),\"\"),\"\")","v":{"$error":"#N/A"}},{"$f":"IF(COLUMN()>=INDIRECT(AQ18),IF(COLUMN()<=INDIRECT(AR18),INDIRECT(AS18),\"\"),\"\")","v":{"$error":"#N/A"}},{"$f":"IF(COLUMN()>=INDIRECT(AQ18),IF(COLUMN()<=INDIRECT(AR18),INDIRECT(AS18),\"\"),\"\")","v":{"$error":"#N/A"}},{"$f":"IF(COLUMN()>=INDIRECT(AQ18),IF(COLUMN()<=INDIRECT(AR18),INDIRECT(AS18),\"\"),\"\")","v":{"$error":"#N/A"}},{"$f":"IF(COLUMN()>=INDIRECT(AQ18),IF(COLUMN()<=INDIRECT(AR18),INDIRECT(AS18),\"\"),\"\")","v":{"$error":"#N/A"}},{"$f":"IF(COLUMN()>=INDIRECT(AQ18),IF(COLUMN()<=INDIRECT(AR18),INDIRECT(AS18),\"\"),\"\")","v":{"$error":"#N/A"}},{"$f":"IF(COLUMN()>=INDIRECT(AQ18),IF(COLUMN()<=INDIRECT(AR18),INDIRECT(AS18),\"\"),\"\")","v":{"$error":"#N/A"}},{"$f":"IF(COLUMN()>=INDIRECT(AQ18),IF(COLUMN()<=INDIRECT(AR18),INDIRECT(AS18),\"\"),\"\")","v":{"$error":"#N/A"}},{"$f":"IF(COLUMN()>=INDIRECT(AQ18),IF(COLUMN()<=INDIRECT(AR18),INDIRECT(AS18),\"\"),\"\")","v":{"$error":"#N/A"}},{"$f":"IF(COLUMN()>=INDIRECT(AQ18),IF(COLUMN()<=INDIRECT(AR18),INDIRECT(AS18),\"\"),\"\")","v":{"$error":"#N/A"}},{"$f":"IF(COLUMN()>=INDIRECT(AQ18),IF(COLUMN()<=INDIRECT(AR18),INDIRECT(AS18),\"\"),\"\")","v":{"$error":"#N/A"}},{"$f":"IF(COLUMN()>=INDIRECT(AQ18),IF(COLUMN()<=INDIRECT(AR18),INDIRECT(AS18),\"\"),\"\")","v":{"$error":"#N/A"}},{"$f":"IF(COLUMN()>=INDIRECT(AQ18),IF(COLUMN()<=INDIRECT(AR18),INDIRECT(AS18),\"\"),\"\")","v":{"$error":"#N/A"}},{"$f":"IF(COLUMN()>=INDIRECT(AQ18),IF(COLUMN()<=INDIRECT(AR18),INDIRECT(AS18),\"\"),\"\")","v":{"$error":"#N/A"}},{"$f":"IF(COLUMN()>=INDIRECT(AQ18),IF(COLUMN()<=INDIRECT(AR18),INDIRECT(AS18),\"\"),\"\")","v":{"$error":"#N/A"}},{"$f":"IF(COLUMN()>=INDIRECT(AQ18),IF(COLUMN()<=INDIRECT(AR18),INDIRECT(AS18),\"\"),\"\")","v":{"$error":"#N/A"}},{"$f":"IF(COLUMN()>=INDIRECT(AQ18),IF(COLUMN()<=INDIRECT(AR18),INDIRECT(AS18),\"\"),\"\")","v":{"$error":"#N/A"}},{"$f":"IF(COLUMN()>=INDIRECT(AQ18),IF(COLUMN()<=INDIRECT(AR18),INDIRECT(AS18),\"\"),\"\")","v":{"$error":"#N/A"}},{"$f":"IF(COLUMN()>=INDIRECT(AQ18),IF(COLUMN()<=INDIRECT(AR18),INDIRECT(AS18),\"\"),\"\")","v":{"$error":"#N/A"}},null,{"$f":"CONCATENATE(\"'\",SUBSTITUTE(SUBSTITUTE(SUBSTITUTE(MID(CELL(\"direccion\",'ETAPA III.a'!M$1),FIND(\"]\",CELL(\"direccion\",'ETAPA III.a'!M$1))+1,LEN(CELL(\"direccion\",'ETAPA III.a'!M$1))),\"$\",\"\"),1,MATCH($A18,'ETAPA III.a'!$K:$K,0)),\"!\",\"!$\"))","v":"'ETAPA III.a'!$M58"},{"$f":"CONCATENATE(\"'\",SUBSTITUTE(SUBSTITUTE(SUBSTITUTE(MID(CELL(\"direccion\",'ETAPA III.a'!N$1),FIND(\"]\",CELL(\"direccion\",'ETAPA III.a'!N$1))+1,LEN(CELL(\"direccion\",'ETAPA III.a'!N$1))),\"$\",\"\"),1,MATCH($A18,'ETAPA III.a'!$K:$K,0)),\"!\",\"!$\"))","v":"'ETAPA III.a'!$N58"},{"$f":"CONCATENATE(\"'\",SUBSTITUTE(SUBSTITUTE(SUBSTITUTE(MID(CELL(\"direccion\",'ETAPA III.a'!L$1),FIND(\"]\",CELL(\"direccion\",'ETAPA III.a'!L$1))+1,LEN(CELL(\"direccion\",'ETAPA III.a'!L$1))),\"$\",\"\"),1,MATCH($A18,'ETAPA III.a'!$K:$K,0)),\"!\",\"!$\"))","v":"'ETAPA III.a'!$L58"}]
[9,{"$f":"IF(COLUMN()>=INDIRECT(AQ19),IF(COLUMN()<=INDIRECT(AR19),INDIRECT(AS19),\"\"),\"\")","v":{"$error":"#N/A"}},{"$f":"IF(COLUMN()>=INDIRECT(AQ19),IF(COLUMN()<=INDIRECT(AR19),INDIRECT(AS19),\"\"),\"\")","v":{"$error":"#N/A"}},{"$f":"IF(COLUMN()>=INDIRECT(AQ19),IF(COLUMN()<=INDIRECT(AR19),INDIRECT(AS19),\"\"),\"\")","v":{"$error":"#N/A"}},{"$f":"IF(COLUMN()>=INDIRECT(AQ19),IF(COLUMN()<=INDIRECT(AR19),INDIRECT(AS19),\"\"),\"\")","v":{"$error":"#N/A"}},{"$f":"IF(COLUMN()>=INDIRECT(AQ19),IF(COLUMN()<=INDIRECT(AR19),INDIRECT(AS19),\"\"),\"\")","v":{"$error":"#N/A"}},{"$f":"IF(COLUMN()>=INDIRECT(AQ19),IF(COLUMN()<=INDIRECT(AR19),INDIRECT(AS19),\"\"),\"\")","v":{"$error":"#N/A"}},{"$f":"IF(COLUMN()>=INDIRECT(AQ19),IF(COLUMN()<=INDIRECT(AR19),INDIRECT(AS19),\"\"),\"\")","v":{"$error":"#N/A"}},{"$f":"IF(COLUMN()>=INDIRECT(AQ19),IF(COLUMN()<=INDIRECT(AR19),INDIRECT(AS19),\"\"),\"\")","v":{"$error":"#N/A"}},{"$f":"IF(COLUMN()>=INDIRECT(AQ19),IF(COLUMN()<=INDIRECT(AR19),INDIRECT(AS19),\"\"),\"\")","v":{"$error":"#N/A"}},{"$f":"IF(COLUMN()>=INDIRECT(AQ19),IF(COLUMN()<=INDIRECT(AR19),INDIRECT(AS19),\"\"),\"\")","v":{"$error":"#N/A"}},{"$f":"IF(COLUMN()>=INDIRECT(AQ19),IF(COLUMN()<=INDIRECT(AR19),INDIRECT(AS19),\"\"),\"\")","v":{"$error":"#N/A"}},{"$f":"IF(COLUMN()>=INDIRECT(AQ19),IF(COLUMN()<=INDIRECT(AR19),INDIRECT(AS19),\"\"),\"\")","v":{"$error":"#N/A"}},{"$f":"IF(COLUMN()>=INDIRECT(AQ19),IF(COLUMN()<=INDIRECT(AR19),INDIRECT(AS19),\"\"),\"\")","v":{"$error":"#N/A"}},{"$f":"IF(COLUMN()>=INDIRECT(AQ19),IF(COLUMN()<=INDIRECT(AR19),INDIRECT(AS19),\"\"),\"\")","v":{"$error":"#N/A"}},{"$f":"IF(COLUMN()>=INDIRECT(AQ19),IF(COLUMN()<=INDIRECT(AR19),INDIRECT(AS19),\"\"),\"\")","v":{"$error":"#N/A"}},{"$f":"IF(COLUMN()>=INDIRECT(AQ19),IF(COLUMN()<=INDIRECT(AR19),INDIRECT(AS19),\"\"),\"\")","v":{"$error":"#N/A"}},{"$f":"IF(COLUMN()>=INDIRECT(AQ19),IF(COLUMN()<=INDIRECT(AR19),INDIRECT(AS19),\"\"),\"\")","v":{"$error":"#N/A"}},{"$f":"IF(COLUMN()>=INDIRECT(AQ19),IF(COLUMN()<=INDIRECT(AR19),INDIRECT(AS19),\"\"),\"\")","v":{"$error":"#N/A"}},{"$f":"IF(COLUMN()>=INDIRECT(AQ19),IF(COLUMN()<=INDIRECT(AR19),INDIRECT(AS19),\"\"),\"\")","v":{"$error":"#N/A"}},{"$f":"IF(COLUMN()>=INDIRECT(AQ19),IF(COLUMN()<=INDIRECT(AR19),INDIRECT(AS19),\"\"),\"\")","v":{"$error":"#N/A"}},{"$f":"IF(COLUMN()>=INDIRECT(AQ19),IF(COLUMN()<=INDIRECT(AR19),INDIRECT(AS19),\"\"),\"\")","v":{"$error":"#N/A"}},{"$f":"IF(COLUMN()>=INDIRECT(AQ19),IF(COLUMN()<=INDIRECT(AR19),INDIRECT(AS19),\"\"),\"\")","v":{"$error":"#N/A"}},{"$f":"IF(COLUMN()>=INDIRECT(AQ19),IF(COLUMN()<=INDIRECT(AR19),INDIRECT(AS19),\"\"),\"\")","v":{"$error":"#N/A"}},{"$f":"IF(COLUMN()>=INDIRECT(AQ19),IF(COLUMN()<=INDIRECT(AR19),INDIRECT(AS19),\"\"),\"\")","v":{"$error":"#N/A"}},{"$f":"IF(COLUMN()>=INDIRECT(AQ19),IF(COLUMN()<=INDIRECT(AR19),INDIRECT(AS19),\"\"),\"\")","v":{"$error":"#N/A"}},{"$f":"IF(COLUMN()>=INDIRECT(AQ19),IF(COLUMN()<=INDIRECT(AR19),INDIRECT(AS19),\"\"),\"\")","v":{"$error":"#N/A"}},{"$f":"IF(COLUMN()>=INDIRECT(AQ19),IF(COLUMN()<=INDIRECT(AR19),INDIRECT(AS19),\"\"),\"\")","v":{"$error":"#N/A"}},{"$f":"IF(COLUMN()>=INDIRECT(AQ19),IF(COLUMN()<=INDIRECT(AR19),INDIRECT(AS19),\"\"),\"\")","v":{"$error":"#N/A"}},{"$f":"IF(COLUMN()>=INDIRECT(AQ19),IF(COLUMN()<=INDIRECT(AR19),INDIRECT(AS19),\"\"),\"\")","v":{"$error":"#N/A"}},{"$f":"IF(COLUMN()>=INDIRECT(AQ19),IF(COLUMN()<=INDIRECT(AR19),INDIRECT(AS19),\"\"),\"\")","v":{"$error":"#N/A"}},{"$f":"IF(COLUMN()>=INDIRECT(AQ19),IF(COLUMN()<=INDIRECT(AR19),INDIRECT(AS19),\"\"),\"\")","v":{"$error":"#N/A"}},{"$f":"IF(COLUMN()>=INDIRECT(AQ19),IF(COLUMN()<=INDIRECT(AR19),INDIRECT(AS19),\"\"),\"\")","v":{"$error":"#N/A"}},{"$f":"IF(COLUMN()>=INDIRECT(AQ19),IF(COLUMN()<=INDIRECT(AR19),INDIRECT(AS19),\"\"),\"\")","v":{"$error":"#N/A"}},{"$f":"IF(COLUMN()>=INDIRECT(AQ19),IF(COLUMN()<=INDIRECT(AR19),INDIRECT(AS19),\"\"),\"\")","v":{"$error":"#N/A"}},{"$f":"IF(COLUMN()>=INDIRECT(AQ19),IF(COLUMN()<=INDIRECT(AR19),INDIRECT(AS19),\"\"),\"\")","v":{"$error":"#N/A"}},{"$f":"IF(COLUMN()>=INDIRECT(AQ19),IF(COLUMN()<=INDIRECT(AR19),INDIRECT(AS19),\"\"),\"\")","v":{"$error":"#N/A"}},{"$f":"IF(COLUMN()>=INDIRECT(AQ19),IF(COLUMN()<=INDIRECT(AR19),INDIRECT(AS19),\"\"),\"\")","v":{"$error":"#N/A"}},{"$f":"IF(COLUMN()>=INDIRECT(AQ19),IF(COLUMN()<=INDIRECT(AR19),INDIRECT(AS19),\"\"),\"\")","v":{"$error":"#N/A"}},{"$f":"IF(COLUMN()>=INDIRECT(AQ19),IF(COLUMN()<=INDIRECT(AR19),INDIRECT(AS19),\"\"),\"\")","v":{"$error":"#N/A"}},{"$f":"IF(COLUMN()>=INDIRECT(AQ19),IF(COLUMN()<=INDIRECT(AR19),INDIRECT(AS19),\"\"),\"\")","v":{"$error":"#N/A"}},null,{"$f":"CONCATENATE(\"'\",SUBSTITUTE(SUBSTITUTE(SUBSTITUTE(MID(CELL(\"direccion\",'ETAPA III.a'!M$1),FIND(\"]\",CELL(\"direccion\",'ETAPA III.a'!M$1))+1,LEN(CELL(\"direccion\",'ETAPA III.a'!M$1))),\"$\",\"\"),1,MATCH($A19,'ETAPA III.a'!$K:$K,0)),\"!\",\"!$\"))","v":"'ETAPA III.a'!$M65"},{"$f":"CONCATENATE(\"'\",SUBSTITUTE(SUBSTITUTE(SUBSTITUTE(MID(CELL(\"direccion\",'ETAPA III.a'!N$1),FIND(\"]\",CELL(\"direccion\",'ETAPA III.a'!N$1))+1,LEN(CELL(\"direccion\",'ETAPA III.a'!N$1))),\"$\",\"\"),1,MATCH($A19,'ETAPA III.a'!$K:$K,0)),\"!\",\"!$\"))","v":"'ETAPA III.a'!$N65"},{"$f":"CONCATENATE(\"'\",SUBSTITUTE(SUBSTITUTE(SUBSTITUTE(MID(CELL(\"direccion\",'ETAPA III.a'!L$1),FIND(\"]\",CELL(\"direccion\",'ETAPA III.a'!L$1))+1,LEN(CELL(\"direccion\",'ETAPA III.a'!L$1))),\"$\",\"\"),1,MATCH($A19,'ETAPA III.a'!$K:$K,0)),\"!\",\"!$\"))","v":"'ETAPA III.a'!$L65"}]
[10,{"$f":"IF(COLUMN()>=INDIRECT(AQ20),IF(COLUMN()<=INDIRECT(AR20),INDIRECT(AS20),\"\"),\"\")","v":{"$error":"#N/A"}},{"$f":"IF(COLUMN()>=INDIRECT(AQ20),IF(COLUMN()<=INDIRECT(AR20),INDIRECT(AS20),\"\"),\"\")","v":{"$error":"#N/A"}},{"$f":"IF(COLUMN()>=INDIRECT(AQ20),IF(COLUMN()<=INDIRECT(AR20),INDIRECT(AS20),\"\"),\"\")","v":{"$error":"#N/A"}},{"$f":"IF(COLUMN()>=INDIRECT(AQ20),IF(COLUMN()<=INDIRECT(AR20),INDIRECT(AS20),\"\"),\"\")","v":{"$error":"#N/A"}},{"$f":"IF(COLUMN()>=INDIRECT(AQ20),IF(COLUMN()<=INDIRECT(AR20),INDIRECT(AS20),\"\"),\"\")","v":{"$error":"#N/A"}},{"$f":"IF(COLUMN()>=INDIRECT(AQ20),IF(COLUMN()<=INDIRECT(AR20),INDIRECT(AS20),\"\"),\"\")","v":{"$error":"#N/A"}},{"$f":"IF(COLUMN()>=INDIRECT(AQ20),IF(COLUMN()<=INDIRECT(AR20),INDIRECT(AS20),\"\"),\"\")","v":{"$error":"#N/A"}},{"$f":"IF(COLUMN()>=INDIRECT(AQ20),IF(COLUMN()<=INDIRECT(AR20),INDIRECT(AS20),\"\"),\"\")","v":{"$error":"#N/A"}},{"$f":"IF(COLUMN()>=INDIRECT(AQ20),IF(COLUMN()<=INDIRECT(AR20),INDIRECT(AS20),\"\"),\"\")","v":{"$error":"#N/A"}},{"$f":"IF(COLUMN()>=INDIRECT(AQ20),IF(COLUMN()<=INDIRECT(AR20),INDIRECT(AS20),\"\"),\"\")","v":{"$error":"#N/A"}},{"$f":"IF(COLUMN()>=INDIRECT(AQ20),IF(COLUMN()<=INDIRECT(AR20),INDIRECT(AS20),\"\"),\"\")","v":{"$error":"#N/A"}},{"$f":"IF(COLUMN()>=INDIRECT(AQ20),IF(COLUMN()<=INDIRECT(AR20),INDIRECT(AS20),\"\"),\"\")","v":{"$error":"#N/A"}},{"$f":"IF(COLUMN()>=INDIRECT(AQ20),IF(COLUMN()<=INDIRECT(AR20),INDIRECT(AS20),\"\"),\"\")","v":{"$error":"#N/A"}},{"$f":"IF(COLUMN()>=INDIRECT(AQ20),IF(COLUMN()<=INDIRECT(AR20),INDIRECT(AS20),\"\"),\"\")","v":{"$error":"#N/A"}},{"$f":"IF(COLUMN()>=INDIRECT(AQ20),IF(COLUMN()<=INDIRECT(AR20),INDIRECT(AS20),\"\"),\"\")","v":{"$error":"#N/A"}},{"$f":"IF(COLUMN()>=INDIRECT(AQ20),IF(COLUMN()<=INDIRECT(AR20),INDIRECT(AS20),\"\"),\"\")","v":{"$error":"#N/A"}},{"$f":"IF(COLUMN()>=INDIRECT(AQ20),IF(COLUMN()<=INDIRECT(AR20),INDIRECT(AS20),\"\"),\"\")","v":{"$error":"#N/A"}},{"$f":"IF(COLUMN()>=INDIRECT(AQ20),IF(COLUMN()<=INDIRECT(AR20),INDIRECT(AS20),\"\"),\"\")","v":{"$error":"#N/A"}},{"$f":"IF(COLUMN()>=INDIRECT(AQ20),IF(COLUMN()<=INDIRECT(AR20),INDIRECT(AS20),\"\"),\"\")","v":{"$error":"#N/A"}},{"$f":"IF(COLUMN()>=INDIRECT(AQ20),IF(COLUMN()<=INDIRECT(AR20),INDIRECT(AS20),\"\"),\"\")","v":{"$error":"#N/A"}},{"$f":"IF(COLUMN()>=INDIRECT(AQ20),IF(COLUMN()<=INDIRECT(AR20),INDIRECT(AS20),\"\"),\"\")","v":{"$error":"#N/A"}},{"$f":"IF(COLUMN()>=INDIRECT(AQ20),IF(COLUMN()<=INDIRECT(AR20),INDIRECT(AS20),\"\"),\"\")","v":{"$error":"#N/A"}},{"$f":"IF(COLUMN()>=INDIRECT(AQ20),IF(COLUMN()<=INDIRECT(AR20),INDIRECT(AS20),\"\"),\"\")","v":{"$error":"#N/A"}},{"$f":"IF(COLUMN()>=INDIRECT(AQ20),IF(COLUMN()<=INDIRECT(AR20),INDIRECT(AS20),\"\"),\"\")","v":{"$error":"#N/A"}},{"$f":"IF(COLUMN()>=INDIRECT(AQ20),IF(COLUMN()<=INDIRECT(AR20),INDIRECT(AS20),\"\"),\"\")","v":{"$error":"#N/A"}},{"$f":"IF(COLUMN()>=INDIRECT(AQ20),IF(COLUMN()<=INDIRECT(AR20),INDIRECT(AS20),\"\"),\"\")","v":{"$error":"#N/A"}},{"$f":"IF(COLUMN()>=INDIRECT(AQ20),IF(COLUMN()<=INDIRECT(AR20),INDIRECT(AS20),\"\"),\"\")","v":{"$error":"#N/A"}},{"$f":"IF(COLUMN()>=INDIRECT(AQ20),IF(COLUMN()<=INDIRECT(AR20),INDIRECT(AS20),\"\"),\"\")","v":{"$error":"#N/A"}},{"$f":"IF(COLUMN()>=INDIRECT(AQ20),IF(COLUMN()<=INDIRECT(AR20),INDIRECT(AS20),\"\"),\"\")","v":{"$error":"#N/A"}},{"$f":"IF(COLUMN()>=INDIRECT(AQ20),IF(COLUMN()<=INDIRECT(AR20),INDIRECT(AS20),\"\"),\"\")","v":{"$error":"#N/A"}},{"$f":"IF(COLUMN()>=INDIRECT(AQ20),IF(COLUMN()<=INDIRECT(AR20),INDIRECT(AS20),\"\"),\"\")","v":{"$error":"#N/A"}},{"$f":"IF(COLUMN()>=INDIRECT(AQ20),IF(COLUMN()<=INDIRECT(AR20),INDIRECT(AS20),\"\"),\"\")","v":{"$error":"#N/A"}},{"$f":"IF(COLUMN()>=INDIRECT(AQ20),IF(COLUMN()<=INDIRECT(AR20),INDIRECT(AS20),\"\"),\"\")","v":{"$error":"#N/A"}},{"$f":"IF(COLUMN()>=INDIRECT(AQ20),IF(COLUMN()<=INDIRECT(AR20),INDIRECT(AS20),\"\"),\"\")","v":{"$error":"#N/A"}},{"$f":"IF(COLUMN()>=INDIRECT(AQ20),IF(COLUMN()<=INDIRECT(AR20),INDIRECT(AS20),\"\"),\"\")","v":{"$error":"#N/A"}},{"$f":"IF(COLUMN()>=INDIRECT(AQ20),IF(COLUMN()<=INDIRECT(AR20),INDIRECT(AS20),\"\"),\"\")","v":{"$error":"#N/A"}},{"$f":"IF(COLUMN()>=INDIRECT(AQ20),IF(COLUMN()<=INDIRECT(AR20),INDIRECT(AS20),\"\"),\"\")","v":{"$error":"#N/A"}},{"$f":"IF(COLUMN()>=INDIRECT(AQ20),IF(COLUMN()<=INDIRECT(AR20),INDIRECT(AS20),\"\"),\"\")","v":{"$error":"#N/A"}},{"$f":"IF(COLUMN()>=INDIRECT(AQ20),IF(COLUMN()<=INDIRECT(AR20),INDIRECT(AS20),\"\"),\"\")","v":{"$error":"#N/A"}},{"$f":"IF(COLUMN()>=INDIRECT(AQ20),IF(COLUMN()<=INDIRECT(AR20),INDIRECT(AS20),\"\"),\"\")","v":{"$error":"#N/A"}},null,{"$f":"CONCATENATE(\"'\",SUBSTITUTE(SUBSTITUTE(SUBSTITUTE(MID(CELL(\"direccion\",'ETAPA III.a'!M$1),FIND(\"]\",CELL(\"direccion\",'ETAPA III.a'!M$1))+1,LEN(CELL(\"direccion\",'ETAPA III.a'!M$1))),\"$\",\"\"),1,MATCH($A20,'ETAPA III.a'!$K:$K,0)),\"!\",\"!$\"))","v":"'ETAPA III.a'!$M72"},{"$f":"CONCATENATE(\"'\",SUBSTITUTE(SUBSTITUTE(SUBSTITUTE(MID(CELL(\"direccion\",'ETAPA III.a'!N$1),FIND(\"]\",CELL(\"direccion\",'ETAPA III.a'!N$1))+1,LEN(CELL(\"direccion\",'ETAPA III.a'!N$1))),\"$\",\"\"),1,MATCH($A20,'ETAPA III.a'!$K:$K,0)),\"!\",\"!$\"))","v":"'ETAPA III.a'!$N72"},{"$f":"CONCATENATE(\"'\",SUBSTITUTE(SUBSTITUTE(SUBSTITUTE(MID(CELL(\"direccion\",'ETAPA III.a'!L$1),FIND(\"]\",CELL(\"direccion\",'ETAPA III.a'!L$1))+1,LEN(CELL(\"direccion\",'ETAPA III.a'!L$1))),\"$\",\"\"),1,MATCH($A20,'ETAPA III.a'!$K:$K,0)),\"!\",\"!$\"))","v":"'ETAPA III.a'!$L72"}]
[11,{"$f":"IF(COLUMN()>=INDIRECT(AQ24),IF(COLUMN()<=INDIRECT(AR24),INDIRECT(AS24),\"\"),\"\")","v":{"$error":"#N/A"}},{"$f":"IF(COLUMN()>=INDIRECT(AQ24),IF(COLUMN()<=INDIRECT(AR24),INDIRECT(AS24),\"\"),\"\")","v":{"$error":"#N/A"}},{"$f":"IF(COLUMN()>=INDIRECT(AQ24),IF(COLUMN()<=INDIRECT(AR24),INDIRECT(AS24),\"\"),\"\")","v":{"$error":"#N/A"}},{"$f":"IF(COLUMN()>=INDIRECT(AQ24),IF(COLUMN()<=INDIRECT(AR24),INDIRECT(AS24),\"\"),\"\")","v":{"$error":"#N/A"}},{"$f":"IF(COLUMN()>=INDIRECT(AQ24),IF(COLUMN()<=INDIRECT(AR24),INDIRECT(AS24),\"\"),\"\")","v":{"$error":"#N/A"}},{"$f":"IF(COLUMN()>=INDIRECT(AQ24),IF(COLUMN()<=INDIRECT(AR24),INDIRECT(AS24),\"\"),\"\")","v":{"$error":"#N/A"}},{"$f":"IF(COLUMN()>=INDIRECT(AQ24),IF(COLUMN()<=INDIRECT(AR24),INDIRECT(AS24),\"\"),\"\")","v":{"$error":"#N/A"}},{"$f":"IF(COLUMN()>=INDIRECT(AQ24),IF(COLUMN()<=INDIRECT(AR24),INDIRECT(AS24),\"\"),\"\")","v":{"$error":"#N/A"}},{"$f":"IF(COLUMN()>=INDIRECT(AQ24),IF(COLUMN()<=INDIRECT(AR24),INDIRECT(AS24),\"\"),\"\")","v":{"$error":"#N/A"}},{"$f":"IF(COLUMN()>=INDIRECT(AQ24),IF(COLUMN()<=INDIRECT(AR24),INDIRECT(AS24),\"\"),\"\")","v":{"$error":"#N/A"}},{"$f":"IF(COLUMN()>=INDIRECT(AQ24),IF(COLUMN()<=INDIRECT(AR24),INDIRECT(AS24),\"\"),\"\")","v":{"$error":"#N/A"}},{"$f":"IF(COLUMN()>=INDIRECT(AQ24),IF(COLUMN()<=INDIRECT(AR24),INDIRECT(AS24),\"\"),\"\")","v":{"$error":"#N/A"}},{"$f":"IF(COLUMN()>=INDIRECT(AQ24),IF(COLUMN()<=INDIRECT(AR24),INDIRECT(AS24),\"\"),\"\")","v":{"$error":"#N/A"}},{"$f":"IF(COLUMN()>=INDIRECT(AQ24),IF(COLUMN()<=INDIRECT(AR24),INDIRECT(AS24),\"\"),\"\")","v":{"$error":"#N/A"}},{"$f":"IF(COLUMN()>=INDIRECT(AQ24),IF(COLUMN()<=INDIRECT(AR24),INDIRECT(AS24),\"\"),\"\")","v":{"$error":"#N/A"}},{"$f":"IF(COLUMN()>=INDIRECT(AQ24),IF(COLUMN()<=INDIRECT(AR24),INDIRECT(AS24),\"\"),\"\")","v":{"$error":"#N/A"}},{"$f":"IF(COLUMN()>=INDIRECT(AQ24),IF(COLUMN()<=INDIRECT(AR24),INDIRECT(AS24),\"\"),\"\")","v":{"$error":"#N/A"}},{"$f":"IF(COLUMN()>=INDIRECT(AQ24),IF(COLUMN()<=INDIRECT(AR24),INDIRECT(AS24),\"\"),\"\")","v":{"$error":"#N/A"}},{"$f":"IF(COLUMN()>=INDIRECT(AQ24),IF(COLUMN()<=INDIRECT(AR24),INDIRECT(AS24),\"\"),\"\")","v":{"$error":"#N/A"}},{"$f":"IF(COLUMN()>=INDIRECT(AQ24),IF(COLUMN()<=INDIRECT(AR24),INDIRECT(AS24),\"\"),\"\")","v":{"$error":"#N/A"}},{"$f":"IF(COLUMN()>=INDIRECT(AQ24),IF(COLUMN()<=INDIRECT(AR24),INDIRECT(AS24),\"\"),\"\")","v":{"$error":"#N/A"}},{"$f":"IF(COLUMN()>=INDIRECT(AQ24),IF(COLUMN()<=INDIRECT(AR24),INDIRECT(AS24),\"\"),\"\")","v":{"$error":"#N/A"}},{"$f":"IF(COLUMN()>=INDIRECT(AQ24),IF(COLUMN()<=INDIRECT(AR24),INDIRECT(AS24),\"\"),\"\")","v":{"$error":"#N/A"}},{"$f":"IF(COLUMN()>=INDIRECT(AQ24),IF(COLUMN()<=INDIRECT(AR24),INDIRECT(AS24),\"\"),\"\")","v":{"$error":"#N/A"}},{"$f":"IF(COLUMN()>=INDIRECT(AQ24),IF(COLUMN()<=INDIRECT(AR24),INDIRECT(AS24),\"\"),\"\")","v":{"$error":"#N/A"}},{"$f":"IF(COLUMN()>=INDIRECT(AQ24),IF(COLUMN()<=INDIRECT(AR24),INDIRECT(AS24),\"\"),\"\")","v":{"$error":"#N/A"}},{"$f":"IF(COLUMN()>=INDIRECT(AQ24),IF(COLUMN()<=INDIRECT(AR24),INDIRECT(AS24),\"\"),\"\")","v":{"$error":"#N/A"}},{"$f":"IF(COLUMN()>=INDIRECT(AQ24),IF(COLUMN()<=INDIRECT(AR24),INDIRECT(AS24),\"\"),\"\")","v":{"$error":"#N/A"}},{"$f":"IF(COLUMN()>=INDIRECT(AQ24),IF(COLUMN()<=INDIRECT(AR24),INDIRECT(AS24),\"\"),\"\")","v":{"$error":"#N/A"}},{"$f":"IF(COLUMN()>=INDIRECT(AQ24),IF(COLUMN()<=INDIRECT(AR24),INDIRECT(AS24),\"\"),\"\")","v":{"$error":"#N/A"}},{"$f":"IF(COLUMN()>=INDIRECT(AQ24),IF(COLUMN()<=INDIRECT(AR24),INDIRECT(AS24),\"\"),\"\")","v":{"$error":"#N/A"}},{"$f":"IF(COLUMN()>=INDIRECT(AQ24),IF(COLUMN()<=INDIRECT(AR24),INDIRECT(AS24),\"\"),\"\")","v":{"$error":"#N/A"}},{"$f":"IF(COLUMN()>=INDIRECT(AQ24),IF(COLUMN()<=INDIRECT(AR24),INDIRECT(AS24),\"\"),\"\")","v":{"$error":"#N/A"}},{"$f":"IF(COLUMN()>=INDIRECT(AQ24),IF(COLUMN()<=INDIRECT(AR24),INDIRECT(AS24),\"\"),\"\")","v":{"$error":"#N/A"}},{"$f":"IF(COLUMN()>=INDIRECT(AQ24),IF(COLUMN()<=INDIRECT(AR24),INDIRECT(AS24),\"\"),\"\")","v":{"$error":"#N/A"}},{"$f":"IF(COLUMN()>=INDIRECT(AQ24),IF(COLUMN()<=INDIRECT(AR24),INDIRECT(AS24),\"\"),\"\")","v":{"$error":"#N/A"}},{"$f":"IF(COLUMN()>=INDIRECT(AQ24),IF(COLUMN()<=INDIRECT(AR24),INDIRECT(AS24),\"\"),\"\")","v":{"$error":"#N/A"}},{"$f":"IF(COLUMN()>=INDIRECT(AQ24),IF(COLUMN()<=INDIRECT(AR24),INDIRECT(AS24),\"\"),\"\")","v":{"$error":"#N/A"}},{"$f":"IF(COLUMN()>=INDIRECT(AQ24),IF(COLUMN()<=INDIRECT(AR24),INDIRECT(AS24),\"\"),\"\")","v":{"$error":"#N/A"}},{"$f":"IF(COLUMN()>=INDIRECT(AQ24),IF(COLUMN()<=INDIRECT(AR24),INDIRECT(AS24),\"\"),\"\")","v":{"$error":"#N/A"}},null,{"$f":"CONCATENATE(\"'\",SUBSTITUTE(SUBSTITUTE(SUBSTITUTE(MID(CELL(\"direccion\",'ETAPA III.a'!M$1),FIND(\"]\",CELL(\"direccion\",'ETAPA III.a'!M$1))+1,LEN(CELL(\"direccion\",'ETAPA III.a'!M$1))),\"$\",\"\"),1,MATCH($A21,'ETAPA III.a'!$K:$K,0)),\"!\",\"!$\"))","v":"'ETAPA III.a'!$M79"},{"$f":"CONCATENATE(\"'\",SUBSTITUTE(SUBSTITUTE(SUBSTITUTE(MID(CELL(\"direccion\",'ETAPA III.a'!N$1),FIND(\"]\",CELL(\"direccion\",'ETAPA III.a'!N$1))+1,LEN(CELL(\"direccion\",'ETAPA III.a'!N$1))),\"$\",\"\"),1,MATCH($A21,'ETAPA III.a'!$K:$K,0)),\"!\",\"!$\"))","v":"'ETAPA III.a'!$N79"},{"$f":"CONCATENATE(\"'\",SUBSTITUTE(SUBSTITUTE(SUBSTITUTE(MID(CELL(\"direccion\",'ETAPA III.a'!L$1),FIND(\"]\",CELL(\"direccion\",'ETAPA III.a'!L$1))+1,LEN(CELL(\"direccion\",'ETAPA III.a'!L$1))),\"$\",\"\"),1,MATCH($A21,'ETAPA III.a'!$K:$K,0)),\"!\",\"!$\"))","v":"'ETAPA III.a'!$L79"}]
[12,{"$f":"IF(COLUMN()>=INDIRECT(AQ25),IF(COLUMN()<=INDIRECT(AR25),INDIRECT(AS25),\"\"),\"\")","v":{"$error":"#N/A"}},{"$f":"IF(COLUMN()>=INDIRECT(AQ25),IF(COLUMN()<=INDIRECT(AR25),INDIRECT(AS25),\"\"),\"\")","v":{"$error":"#N/A"}},{"$f":"IF(COLUMN()>=INDIRECT(AQ25),IF(COLUMN()<=INDIRECT(AR25),INDIRECT(AS25),\"\"),\"\")","v":{"$error":"#N/A"}},{"$f":"IF(COLUMN()>=INDIRECT(AQ25),IF(COLUMN()<=INDIRECT(AR25),INDIRECT(AS25),\"\"),\"\")","v":{"$error":"#N/A"}},{"$f":"IF(COLUMN()>=INDIRECT(AQ25),IF(COLUMN()<=INDIRECT(AR25),INDIRECT(AS25),\"\"),\"\")","v":{"$error":"#N/A"}},{"$f":"IF(COLUMN()>=INDIRECT(AQ25),IF(COLUMN()<=INDIRECT(AR25),INDIRECT(AS25),\"\"),\"\")","v":{"$error":"#N/A"}},{"$f":"IF(COLUMN()>=INDIRECT(AQ25),IF(COLUMN()<=INDIRECT(AR25),INDIRECT(AS25),\"\"),\"\")","v":{"$error":"#N/A"}},{"$f":"IF(COLUMN()>=INDIRECT(AQ25),IF(COLUMN()<=INDIRECT(AR25),INDIRECT(AS25),\"\"),\"\")","v":{"$error":"#N/A"}},{"$f":"IF(COLUMN()>=INDIRECT(AQ25),IF(COLUMN()<=INDIRECT(AR25),INDIRECT(AS25),\"\"),\"\")","v":{"$error":"#N/A"}},{"$f":"IF(COLUMN()>=INDIRECT(AQ25),IF(COLUMN()<=INDIRECT(AR25),INDIRECT(AS25),\"\"),\"\")","v":{"$error":"#N/A"}},{"$f":"IF(COLUMN()>=INDIRECT(AQ25),IF(COLUMN()<=INDIRECT(AR25),INDIRECT(AS25),\"\"),\"\")","v":{"$error":"#N/A"}},{"$f":"IF(COLUMN()>=INDIRECT(AQ25),IF(COLUMN()<=INDIRECT(AR25),INDIRECT(AS25),\"\"),\"\")","v":{"$error":"#N/A"}},{"$f":"IF(COLUMN()>=INDIRECT(AQ25),IF(COLUMN()<=INDIRECT(AR25),INDIRECT(AS25),\"\"),\"\")","v":{"$error":"#N/A"}},{"$f":"IF(COLUMN()>=INDIRECT(AQ25),IF(COLUMN()<=INDIRECT(AR25),INDIRECT(AS25),\"\"),\"\")","v":{"$error":"#N/A"}},{"$f":"IF(COLUMN()>=INDIRECT(AQ25),IF(COLUMN()<=INDIRECT(AR25),INDIRECT(AS25),\"\"),\"\")","v":{"$error":"#N/A"}},{"$f":"IF(COLUMN()>=INDIRECT(AQ25),IF(COLUMN()<=INDIRECT(AR25),INDIRECT(AS25),\"\"),\"\")","v":{"$error":"#N/A"}},{"$f":"IF(COLUMN()>=INDIRECT(AQ25),IF(COLUMN()<=INDIRECT(AR25),INDIRECT(AS25),\"\"),\"\")","v":{"$error":"#N/A"}},{"$f":"IF(COLUMN()>=INDIRECT(AQ25),IF(COLUMN()<=INDIRECT(AR25),INDIRECT(AS25),\"\"),\"\")","v":{"$error":"#N/A"}},{"$f":"IF(COLUMN()>=INDIRECT(AQ25),IF(COLUMN()<=INDIRECT(AR25),INDIRECT(AS25),\"\"),\"\")","v":{"$error":"#N/A"}},{"$f":"IF(COLUMN()>=INDIRECT(AQ25),IF(COLUMN()<=INDIRECT(AR25),INDIRECT(AS25),\"\"),\"\")","v":{"$error":"#N/A"}},{"$f":"IF(COLUMN()>=INDIRECT(AQ25),IF(COLUMN()<=INDIRECT(AR25),INDIRECT(AS25),\"\"),\"\")","v":{"$error":"#N/A"}},{"$f":"IF(COLUMN()>=INDIRECT(AQ25),IF(COLUMN()<=INDIRECT(AR25),INDIRECT(AS25),\"\"),\"\")","v":{"$error":"#N/A"}},{"$f":"IF(COLUMN()>=INDIRECT(AQ25),IF(COLUMN()<=INDIRECT(AR25),INDIRECT(AS25),\"\"),\"\")","v":{"$error":"#N/A"}},{"$f":"IF(COLUMN()>=INDIRECT(AQ25),IF(COLUMN()<=INDIRECT(AR25),INDIRECT(AS25),\"\"),\"\")","v":{"$error":"#N/A"}},{"$f":"IF(COLUMN()>=INDIRECT(AQ25),IF(COLUMN()<=INDIRECT(AR25),INDIRECT(AS25),\"\"),\"\")","v":{"$error":"#N/A"}},{"$f":"IF(COLUMN()>=INDIRECT(AQ25),IF(COLUMN()<=INDIRECT(AR25),INDIRECT(AS25),\"\"),\"\")","v":{"$error":"#N/A"}},{"$f":"IF(COLUMN()>=INDIRECT(AQ25),IF(COLUMN()<=INDIRECT(AR25),INDIRECT(AS25),\"\"),\"\")","v":{"$error":"#N/A"}},{"$f":"IF(COLUMN()>=INDIRECT(AQ25),IF(COLUMN()<=INDIRECT(AR25),INDIRECT(AS25),\"\"),\"\")","v":{"$error":"#N/A"}},{"$f":"IF(COLUMN()>=INDIRECT(AQ25),IF(COLUMN()<=INDIRECT(AR25),INDIRECT(AS25),\"\"),\"\")","v":{"$error":"#N/A"}},{"$f":"IF(COLUMN()>=INDIRECT(AQ25),IF(COLUMN()<=INDIRECT(AR25),INDIRECT(AS25),\"\"),\"\")","v":{"$error":"#N/A"}},{"$f":"IF(COLUMN()>=INDIRECT(AQ25),IF(COLUMN()<=INDIRECT(AR25),INDIRECT(AS25),\"\"),\"\")","v":{"$error":"#N/A"}},{"$f":"IF(COLUMN()>=INDIRECT(AQ25),IF(COLUMN()<=INDIRECT(AR25),INDIRECT(AS25),\"\"),\"\")","v":{"$error":"#N/A"}},{"$f":"IF(COLUMN()>=INDIRECT(AQ25),IF(COLUMN()<=INDIRECT(AR25),INDIRECT(AS25),\"\"),\"\")","v":{"$error":"#N/A"}},{"$f":"IF(COLUMN()>=INDIRECT(AQ25),IF(COLUMN()<=INDIRECT(AR25),INDIRECT(AS25),\"\"),\"\")","v":{"$error":"#N/A"}},{"$f":"IF(COLUMN()>=INDIRECT(AQ25),IF(COLUMN()<=INDIRECT(AR25),INDIRECT(AS25),\"\"),\"\")","v":{"$error":"#N/A"}},{"$f":"IF(COLUMN()>=INDIRECT(AQ25),IF(COLUMN()<=INDIRECT(AR25),INDIRECT(AS25),\"\"),\"\")","v":{"$error":"#N/A"}},{"$f":"IF(COLUMN()>=INDIRECT(AQ25),IF(COLUMN()<=INDIRECT(AR25),INDIRECT(AS25),\"\"),\"\")","v":{"$error":"#N/A"}},{"$f":"IF(COLUMN()>=INDIRECT(AQ25),IF(COLUMN()<=INDIRECT(AR25),INDIRECT(AS25),\"\"),\"\")","v":{"$error":"#N/A"}},{"$f":"IF(COLUMN()>=INDIRECT(AQ25),IF(COLUMN()<=INDIRECT(AR25),INDIRECT(AS25),\"\"),\"\")","v":{"$error":"#N/A"}},{"$f":"IF(COLUMN()>=INDIRECT(AQ25),IF(COLUMN()<=INDIRECT(AR25),INDIRECT(AS25),\"\"),\"\")","v":{"$error":"#N/A"}},null,{"$f":"CONCATENATE(\"'\",SUBSTITUTE(SUBSTITUTE(SUBSTITUTE(MID(CELL(\"direccion\",'ETAPA III.a'!M$1),FIND(\"]\",CELL(\"direccion\",'ETAPA III.a'!M$1))+1,LEN(CELL(\"direccion\",'ETAPA III.a'!M$1))),\"$\",\"\"),1,MATCH($A22,'ETAPA III.a'!$K:$K,0)),\"!\",\"!$\"))","v":"'ETAPA III.a'!$M86"},{"$f":"CONCATENATE(\"'\",SUBSTITUTE(SUBSTITUTE(SUBSTITUTE(MID(CELL(\"direccion\",'ETAPA III.a'!N$1),FIND(\"]\",CELL(\"direccion\",'ETAPA III.a'!N$1))+1,LEN(CELL(\"direccion\",'ETAPA III.a'!N$1))),\"$\",\"\"),1,MATCH($A22,'ETAPA III.a'!$K:$K,0)),\"!\",\"!$\"))","v":"'ETAPA III.a'!$N86"},{"$f":"CONCATENATE(\"'\",SUBSTITUTE(SUBSTITUTE(SUBSTITUTE(MID(CELL(\"direccion\",'ETAPA III.a'!L$1),FIND(\"]\",CELL(\"direccion\",'ETAPA III.a'!L$1))+1,LEN(CELL(\"direccion\",'ETAPA III.a'!L$1))),\"$\",\"\"),1,MATCH($A22,'ETAPA III.a'!$K:$K,0)),\"!\",\"!$\"))","v":"'ETAPA III.a'!$L86"}]
[13,{"$f":"IF(COLUMN()>=INDIRECT(AQ26),IF(COLUMN()<=INDIRECT(AR26),INDIRECT(AS26),\"\"),\"\")","v":{"$error":"#N/A"}},{"$f":"IF(COLUMN()>=INDIRECT(AQ26),IF(COLUMN()<=INDIRECT(AR26),INDIRECT(AS26),\"\"),\"\")","v":{"$error":"#N/A"}},{"$f":"IF(COLUMN()>=INDIRECT(AQ26),IF(COLUMN()<=INDIRECT(AR26),INDIRECT(AS26),\"\"),\"\")","v":{"$error":"#N/A"}},{"$f":"IF(COLUMN()>=INDIRECT(AQ26),IF(COLUMN()<=INDIRECT(AR26),INDIRECT(AS26),\"\"),\"\")","v":{"$error":"#N/A"}},{"$f":"IF(COLUMN()>=INDIRECT(AQ26),IF(COLUMN()<=INDIRECT(AR26),INDIRECT(AS26),\"\"),\"\")","v":{"$error":"#N/A"}},{"$f":"IF(COLUMN()>=INDIRECT(AQ26),IF(COLUMN()<=INDIRECT(AR26),INDIRECT(AS26),\"\"),\"\")","v":{"$error":"#N/A"}},{"$f":"IF(COLUMN()>=INDIRECT(AQ26),IF(COLUMN()<=INDIRECT(AR26),INDIRECT(AS26),\"\"),\"\")","v":{"$error":"#N/A"}},{"$f":"IF(COLUMN()>=INDIRECT(AQ26),IF(COLUMN()<=INDIRECT(AR26),INDIRECT(AS26),\"\"),\"\")","v":{"$error":"#N/A"}},{"$f":"IF(COLUMN()>=INDIRECT(AQ26),IF(COLUMN()<=INDIRECT(AR26),INDIRECT(AS26),\"\"),\"\")","v":{"$error":"#N/A"}},{"$f":"IF(COLUMN()>=INDIRECT(AQ26),IF(COLUMN()<=INDIRECT(AR26),INDIRECT(AS26),\"\"),\"\")","v":{"$error":"#N/A"}},{"$f":"IF(COLUMN()>=INDIRECT(AQ26),IF(COLUMN()<=INDIRECT(AR26),INDIRECT(AS26),\"\"),\"\")","v":{"$error":"#N/A"}},{"$f":"IF(COLUMN()>=INDIRECT(AQ26),IF(COLUMN()<=INDIRECT(AR26),INDIRECT(AS26),\"\"),\"\")","v":{"$error":"#N/A"}},{"$f":"IF(COLUMN()>=INDIRECT(AQ26),IF(COLUMN()<=INDIRECT(AR26),INDIRECT(AS26),\"\"),\"\")","v":{"$error":"#N/A"}},{"$f":"IF(COLUMN()>=INDIRECT(AQ26),IF(COLUMN()<=INDIRECT(AR26),INDIRECT(AS26),\"\"),\"\")","v":{"$error":"#N/A"}},{"$f":"IF(COLUMN()>=INDIRECT(AQ26),IF(COLUMN()<=INDIRECT(AR26),INDIRECT(AS26),\"\"),\"\")","v":{"$error":"#N/A"}},{"$f":"IF(COLUMN()>=INDIRECT(AQ26),IF(COLUMN()<=INDIRECT(AR26),INDIRECT(AS26),\"\"),\"\")","v":{"$error":"#N/A"}},{"$f":"IF(COLUMN()>=INDIRECT(AQ26),IF(COLUMN()<=INDIRECT(AR26),INDIRECT(AS26),\"\"),\"\")","v":{"$error":"#N/A"}},{"$f":"IF(COLUMN()>=INDIRECT(AQ26),IF(COLUMN()<=INDIRECT(AR26),INDIRECT(AS26),\"\"),\"\")","v":{"$error":"#N/A"}},{"$f":"IF(COLUMN()>=INDIRECT(AQ26),IF(COLUMN()<=INDIRECT(AR26),INDIRECT(AS26),\"\"),\"\")","v":{"$error":"#N/A"}},{"$f":"IF(COLUMN()>=INDIRECT(AQ26),IF(COLUMN()<=INDIRECT(AR26),INDIRECT(AS26),\"\"),\"\")","v":{"$error":"#N/A"}},{"$f":"IF(COLUMN()>=INDIRECT(AQ26),IF(COLUMN()<=INDIRECT(AR26),INDIRECT(AS26),\"\"),\"\")","v":{"$error":"#N/A"}},{"$f":"IF(COLUMN()>=INDIRECT(AQ26),IF(COLUMN()<=INDIRECT(AR26),INDIRECT(AS26),\"\"),\"\")","v":{"$error":"#N/A"}},{"$f":"IF(COLUMN()>=INDIRECT(AQ26),IF(COLUMN()<=INDIRECT(AR26),INDIRECT(AS26),\"\"),\"\")","v":{"$error":"#N/A"}},{"$f":"IF(COLUMN()>=INDIRECT(AQ26),IF(COLUMN()<=INDIRECT(AR26),INDIRECT(AS26),\"\"),\"\")","v":{"$error":"#N/A"}},{"$f":"IF(COLUMN()>=INDIRECT(AQ26),IF(COLUMN()<=INDIRECT(AR26),INDIRECT(AS26),\"\"),\"\")","v":{"$error":"#N/A"}},{"$f":"IF(COLUMN()>=INDIRECT(AQ26),IF(COLUMN()<=INDIRECT(AR26),INDIRECT(AS26),\"\"),\"\")","v":{"$error":"#N/A"}},{"$f":"IF(COLUMN()>=INDIRECT(AQ26),IF(COLUMN()<=INDIRECT(AR26),INDIRECT(AS26),\"\"),\"\")","v":{"$error":"#N/A"}},{"$f":"IF(COLUMN()>=INDIRECT(AQ26),IF(COLUMN()<=INDIRECT(AR26),INDIRECT(AS26),\"\"),\"\")","v":{"$error":"#N/A"}},{"$f":"IF(COLUMN()>=INDIRECT(AQ26),IF(COLUMN()<=INDIRECT(AR26),INDIRECT(AS26),\"\"),\"\")","v":{"$error":"#N/A"}},{"$f":"IF(COLUMN()>=INDIRECT(AQ26),IF(COLUMN()<=INDIRECT(AR26),INDIRECT(AS26),\"\"),\"\")","v":{"$error":"#N/A"}},{"$f":"IF(COLUMN()>=INDIRECT(AQ26),IF(COLUMN()<=INDIRECT(AR26),INDIRECT(AS26),\"\"),\"\")","v":{"$error":"#N/A"}},{"$f":"IF(COLUMN()>=INDIRECT(AQ26),IF(COLUMN()<=INDIRECT(AR26),INDIRECT(AS26),\"\"),\"\")","v":{"$error":"#N/A"}},{"$f":"IF(COLUMN()>=INDIRECT(AQ26),IF(COLUMN()<=INDIRECT(AR26),INDIRECT(AS26),\"\"),\"\")","v":{"$error":"#N/A"}},{"$f":"IF(COLUMN()>=INDIRECT(AQ26),IF(COLUMN()<=INDIRECT(AR26),INDIRECT(AS26),\"\"),\"\")","v":{"$error":"#N/A"}},{"$f":"IF(COLUMN()>=INDIRECT(AQ26),IF(COLUMN()<=INDIRECT(AR26),INDIRECT(AS26),\"\"),\"\")","v":{"$error":"#N/A"}},{"$f":"IF(COLUMN()>=INDIRECT(AQ26),IF(COLUMN()<=INDIRECT(AR26),INDIRECT(AS26),\"\"),\"\")","v":{"$error":"#N/A"}},{"$f":"IF(COLUMN()>=INDIRECT(AQ26),IF(COLUMN()<=INDIRECT(AR26),INDIRECT(AS26),\"\"),\"\")","v":{"$error":"#N/A"}},{"$f":"IF(COLUMN()>=INDIRECT(AQ26),IF(COLUMN()<=INDIRECT(AR26),INDIRECT(AS26),\"\"),\"\")","v":{"$error":"#N/A"}},{"$f":"IF(COLUMN()>=INDIRECT(AQ26),IF(COLUMN()<=INDIRECT(AR26),INDIRECT(AS26),\"\"),\"\")","v":{"$error":"#N/A"}},{"$f":"IF(COLUMN()>=INDIRECT(AQ26),IF(COLUMN()<=INDIRECT(AR26),INDIRECT(AS26),\"\"),\"\")","v":{"$error":"#N/A"}},null,{"$f":"CONCATENATE(\"'\",SUBSTITUTE(SUBSTITUTE(SUBSTITUTE(MID(CELL(\"direccion\",'ETAPA III.a'!M$1),FIND(\"]\",CELL(\"direccion\",'ETAPA III.a'!M$1))+1,LEN(CELL(\"direccion\",'ETAPA III.a'!M$1))),\"$\",\"\"),1,MATCH($A23,'ETAPA III.a'!$K:$K,0)),\"!\",\"!$\"))","v":"'ETAPA III.a'!$M96"},{"$f":"CONCATENATE(\"'\",SUBSTITUTE(SUBSTITUTE(SUBSTITUTE(MID(CELL(\"direccion\",'ETAPA III.a'!N$1),FIND(\"]\",CELL(\"direccion\",'ETAPA III.a'!N$1))+1,LEN(CELL(\"direccion\",'ETAPA III.a'!N$1))),\"$\",\"\"),1,MATCH($A23,'ETAPA III.a'!$K:$K,0)),\"!\",\"!$\"))","v":"'ETAPA III.a'!$N96"},{"$f":"CONCATENATE(\"'\",SUBSTITUTE(SUBSTITUTE(SUBSTITUTE(MID(CELL(\"direccion\",'ETAPA III.a'!L$1),FIND(\"]\",CELL(\"direccion\",'ETAPA III.a'!L$1))+1,LEN(CELL(\"direccion\",'ETAPA III.a'!L$1))),\"$\",\"\"),1,MATCH($A23,'ETAPA III.a'!$K:$K,0)),\"!\",\"!$\"))","v":"'ETAPA III.a'!$L96"}]
[14,{"$f":"IF(COLUMN()>=INDIRECT(AQ27),IF(COLUMN()<=INDIRECT(AR27),INDIRECT(AS27),\"\"),\"\")","v":{"$error":"#N/A"}},{"$f":"IF(COLUMN()>=INDIRECT(AQ27),IF(COLUMN()<=INDIRECT(AR27),INDIRECT(AS27),\"\"),\"\")","v":{"$error":"#N/A"}},{"$f":"IF(COLUMN()>=INDIRECT(AQ27),IF(COLUMN()<=INDIRECT(AR27),INDIRECT(AS27),\"\"),\"\")","v":{"$error":"#N/A"}},{"$f":"IF(COLUMN()>=INDIRECT(AQ27),IF(COLUMN()<=INDIRECT(AR27),INDIRECT(AS27),\"\"),\"\")","v":{"$error":"#N/A"}},{"$f":"IF(COLUMN()>=INDIRECT(AQ27),IF(COLUMN()<=INDIRECT(AR27),INDIRECT(AS27),\"\"),\"\")","v":{"$error":"#N/A"}},{"$f":"IF(COLUMN()>=INDIRECT(AQ27),IF(COLUMN()<=INDIRECT(AR27),INDIRECT(AS27),\"\"),\"\")","v":{"$error":"#N/A"}},{"$f":"IF(COLUMN()>=INDIRECT(AQ27),IF(COLUMN()<=INDIRECT(AR27),INDIRECT(AS27),\"\"),\"\")","v":{"$error":"#N/A"}},{"$f":"IF(COLUMN()>=INDIRECT(AQ27),IF(COLUMN()<=INDIRECT(AR27),INDIRECT(AS27),\"\"),\"\")","v":{"$error":"#N/A"}},{"$f":"IF(COLUMN()>=INDIRECT(AQ27),IF(COLUMN()<=INDIRECT(AR27),INDIRECT(AS27),\"\"),\"\")","v":{"$error":"#N/A"}},{"$f":"IF(COLUMN()>=INDIRECT(AQ27),IF(COLUMN()<=INDIRECT(AR27),INDIRECT(AS27),\"\"),\"\")","v":{"$error":"#N/A"}},{"$f":"IF(COLUMN()>=INDIRECT(AQ27),IF(COLUMN()<=INDIRECT(AR27),INDIRECT(AS27),\"\"),\"\")","v":{"$error":"#N/A"}},{"$f":"IF(COLUMN()>=INDIRECT(AQ27),IF(COLUMN()<=INDIRECT(AR27),INDIRECT(AS27),\"\"),\"\")","v":{"$error":"#N/A"}},{"$f":"IF(COLUMN()>=INDIRECT(AQ27),IF(COLUMN()<=INDIRECT(AR27),INDIRECT(AS27),\"\"),\"\")","v":{"$error":"#N/A"}},{"$f":"IF(COLUMN()>=INDIRECT(AQ27),IF(COLUMN()<=INDIRECT(AR27),INDIRECT(AS27),\"\"),\"\")","v":{"$error":"#N/A"}},{"$f":"IF(COLUMN()>=INDIRECT(AQ27),IF(COLUMN()<=INDIRECT(AR27),INDIRECT(AS27),\"\"),\"\")","v":{"$error":"#N/A"}},{"$f":"IF(COLUMN()>=INDIRECT(AQ27),IF(COLUMN()<=INDIRECT(AR27),INDIRECT(AS27),\"\"),\"\")","v":{"$error":"#N/A"}},{"$f":"IF(COLUMN()>=INDIRECT(AQ27),IF(COLUMN()<=INDIRECT(AR27),INDIRECT(AS27),\"\"),\"\")","v":{"$error":"#N/A"}},{"$f":"IF(COLUMN()>=INDIRECT(AQ27),IF(COLUMN()<=INDIRECT(AR27),INDIRECT(AS27),\"\"),\"\")","v":{"$error":"#N/A"}},{"$f":"IF(COLUMN()>=INDIRECT(AQ27),IF(COLUMN()<=INDIRECT(AR27),INDIRECT(AS27),\"\"),\"\")","v":{"$error":"#N/A"}},{"$f":"IF(COLUMN()>=INDIRECT(AQ27),IF(COLUMN()<=INDIRECT(AR27),INDIRECT(AS27),\"\"),\"\")","v":{"$error":"#N/A"}},{"$f":"IF(COLUMN()>=INDIRECT(AQ27),IF(COLUMN()<=INDIRECT(AR27),INDIRECT(AS27),\"\"),\"\")","v":{"$error":"#N/A"}},{"$f":"IF(COLUMN()>=INDIRECT(AQ27),IF(COLUMN()<=INDIRECT(AR27),INDIRECT(AS27),\"\"),\"\")","v":{"$error":"#N/A"}},{"$f":"IF(COLUMN()>=INDIRECT(AQ27),IF(COLUMN()<=INDIRECT(AR27),INDIRECT(AS27),\"\"),\"\")","v":{"$error":"#N/A"}},{"$f":"IF(COLUMN()>=INDIRECT(AQ27),IF(COLUMN()<=INDIRECT(AR27),INDIRECT(AS27),\"\"),\"\")","v":{"$error":"#N/A"}},{"$f":"IF(COLUMN()>=INDIRECT(AQ27),IF(COLUMN()<=INDIRECT(AR27),INDIRECT(AS27),\"\"),\"\")","v":{"$error":"#N/A"}},{"$f":"IF(COLUMN()>=INDIRECT(AQ27),IF(COLUMN()<=INDIRECT(AR27),INDIRECT(AS27),\"\"),\"\")","v":{"$error":"#N/A"}},{"$f":"IF(COLUMN()>=INDIRECT(AQ27),IF(COLUMN()<=INDIRECT(AR27),INDIRECT(AS27),\"\"),\"\")","v":{"$error":"#N/A"}},{"$f":"IF(COLUMN()>=INDIRECT(AQ27),IF(COLUMN()<=INDIRECT(AR27),INDIRECT(AS27),\"\"),\"\")","v":{"$error":"#N/A"}},{"$f":"IF(COLUMN()>=INDIRECT(AQ27),IF(COLUMN()<=INDIRECT(AR27),INDIRECT(AS27),\"\"),\"\")","v":{"$error":"#N/A"}},{"$f":"IF(COLUMN()>=INDIRECT(AQ27),IF(COLUMN()<=INDIRECT(AR27),INDIRECT(AS27),\"\"),\"\")","v":{"$error":"#N/A"}},{"$f":"IF(COLUMN()>=INDIRECT(AQ27),IF(COLUMN()<=INDIRECT(AR27),INDIRECT(AS27),\"\"),\"\")","v":{"$error":"#N/A"}},{"$f":"IF(COLUMN()>=INDIRECT(AQ27),IF(COLUMN()<=INDIRECT(AR27),INDIRECT(AS27),\"\"),\"\")","v":{"$error":"#N/A"}},{"$f":"IF(COLUMN()>=INDIRECT(AQ27),IF(COLUMN()<=INDIRECT(AR27),INDIRECT(AS27),\"\"),\"\")","v":{"$error":"#N/A"}},{"$f":"IF(COLUMN()>=INDIRECT(AQ27),IF(COLUMN()<=INDIRECT(AR27),INDIRECT(AS27),\"\"),\"\")","v":{"$error":"#N/A"}},{"$f":"IF(COLUMN()>=INDIRECT(AQ27),IF(COLUMN()<=INDIRECT(AR27),INDIRECT(AS27),\"\"),\"\")","v":{"$error":"#N/A"}},{"$f":"IF(COLUMN()>=INDIRECT(AQ27),IF(COLUMN()<=INDIRECT(AR27),INDIRECT(AS27),\"\"),\"\")","v":{"$error":"#N/A"}},{"$f":"IF(COLUMN()>=INDIRECT(AQ27),IF(COLUMN()<=INDIRECT(AR27),INDIRECT(AS27),\"\"),\"\")","v":{"$error":"#N/A"}},{"$f":"IF(COLUMN()>=INDIRECT(AQ27),IF(COLUMN()<=INDIRECT(AR27),INDIRECT(AS27),\"\"),\"\")","v":{"$error":"#N/A"}},{"$f":"IF(COLUMN()>=INDIRECT(AQ27),IF(COLUMN()<=INDIRECT(AR27),INDIRECT(AS27),\"\"),\"\")","v":{"$error":"#N/A"}},{"$f":"IF(COLUMN()>=INDIRECT(AQ27),IF(COLUMN()<=INDIRECT(AR27),INDIRECT(AS27),\"\"),\"\")","v":{"$error":"#N/A"}},null,{"$f":"CONCATENATE(\"'\",SUBSTITUTE(SUBSTITUTE(SUBSTITUTE(MID(CELL(\"direccion\",'ETAPA III.a'!M$1),FIND(\"]\",CELL(\"direccion\",'ETAPA III.a'!M$1))+1,LEN(CELL(\"direccion\",'ETAPA III.a'!M$1))),\"$\",\"\"),1,MATCH($A24,'ETAPA III.a'!$K:$K,0)),\"!\",\"!$\"))","v":"'ETAPA III.a'!$M103"},{"$f":"CONCATENATE(\"'\",SUBSTITUTE(SUBSTITUTE(SUBSTITUTE(MID(CELL(\"direccion\",'ETAPA III.a'!N$1),FIND(\"]\",CELL(\"direccion\",'ETAPA III.a'!N$1))+1,LEN(CELL(\"direccion\",'ETAPA III.a'!N$1))),\"$\",\"\"),1,MATCH($A24,'ETAPA III.a'!$K:$K,0)),\"!\",\"!$\"))","v":"'ETAPA III.a'!$N103"},{"$f":"CONCATENATE(\"'\",SUBSTITUTE(SUBSTITUTE(SUBSTITUTE(MID(CELL(\"direccion\",'ETAPA III.a'!L$1),FIND(\"]\",CELL(\"direccion\",'ETAPA III.a'!L$1))+1,LEN(CELL(\"direccion\",'ETAPA III.a'!L$1))),\"$\",\"\"),1,MATCH($A24,'ETAPA III.a'!$K:$K,0)),\"!\",\"!$\"))","v":"'ETAPA III.a'!$L103"}]
[15,{"$f":"IF(COLUMN()>=INDIRECT(AQ28),IF(COLUMN()<=INDIRECT(AR28),INDIRECT(AS28),\"\"),\"\")","v":{"$error":"#N/A"}},{"$f":"IF(COLUMN()>=INDIRECT(AQ28),IF(COLUMN()<=INDIRECT(AR28),INDIRECT(AS28),\"\"),\"\")","v":{"$error":"#N/A"}},{"$f":"IF(COLUMN()>=INDIRECT(AQ28),IF(COLUMN()<=INDIRECT(AR28),INDIRECT(AS28),\"\"),\"\")","v":{"$error":"#N/A"}},{"$f":"IF(COLUMN()>=INDIRECT(AQ28),IF(COLUMN()<=INDIRECT(AR28),INDIRECT(AS28),\"\"),\"\")","v":{"$error":"#N/A"}},{"$f":"IF(COLUMN()>=INDIRECT(AQ28),IF(COLUMN()<=INDIRECT(AR28),INDIRECT(AS28),\"\"),\"\")","v":{"$error":"#N/A"}},{"$f":"IF(COLUMN()>=INDIRECT(AQ28),IF(COLUMN()<=INDIRECT(AR28),INDIRECT(AS28),\"\"),\"\")","v":{"$error":"#N/A"}},{"$f":"IF(COLUMN()>=INDIRECT(AQ28),IF(COLUMN()<=INDIRECT(AR28),INDIRECT(AS28),\"\"),\"\")","v":{"$error":"#N/A"}},{"$f":"IF(COLUMN()>=INDIRECT(AQ28),IF(COLUMN()<=INDIRECT(AR28),INDIRECT(AS28),\"\"),\"\")","v":{"$error":"#N/A"}},{"$f":"IF(COLUMN()>=INDIRECT(AQ28),IF(COLUMN()<=INDIRECT(AR28),INDIRECT(AS28),\"\"),\"\")","v":{"$error":"#N/A"}},{"$f":"IF(COLUMN()>=INDIRECT(AQ28),IF(COLUMN()<=INDIRECT(AR28),INDIRECT(AS28),\"\"),\"\")","v":{"$error":"#N/A"}},{"$f":"IF(COLUMN()>=INDIRECT(AQ28),IF(COLUMN()<=INDIRECT(AR28),INDIRECT(AS28),\"\"),\"\")","v":{"$error":"#N/A"}},{"$f":"IF(COLUMN()>=INDIRECT(AQ28),IF(COLUMN()<=INDIRECT(AR28),INDIRECT(AS28),\"\"),\"\")","v":{"$error":"#N/A"}},{"$f":"IF(COLUMN()>=INDIRECT(AQ28),IF(COLUMN()<=INDIRECT(AR28),INDIRECT(AS28),\"\"),\"\")","v":{"$error":"#N/A"}},{"$f":"IF(COLUMN()>=INDIRECT(AQ28),IF(COLUMN()<=INDIRECT(AR28),INDIRECT(AS28),\"\"),\"\")","v":{"$error":"#N/A"}},{"$f":"IF(COLUMN()>=INDIRECT(AQ28),IF(COLUMN()<=INDIRECT(AR28),INDIRECT(AS28),\"\"),\"\")","v":{"$error":"#N/A"}},{"$f":"IF(COLUMN()>=INDIRECT(AQ28),IF(COLUMN()<=INDIRECT(AR28),INDIRECT(AS28),\"\"),\"\")","v":{"$error":"#N/A"}},{"$f":"IF(COLUMN()>=INDIRECT(AQ28),IF(COLUMN()<=INDIRECT(AR28),INDIRECT(AS28),\"\"),\"\")","v":{"$error":"#N/A"}},{"$f":"IF(COLUMN()>=INDIRECT(AQ28),IF(COLUMN()<=INDIRECT(AR28),INDIRECT(AS28),\"\"),\"\")","v":{"$error":"#N/A"}},{"$f":"IF(COLUMN()>=INDIRECT(AQ28),IF(COLUMN()<=INDIRECT(AR28),INDIRECT(AS28),\"\"),\"\")","v":{"$error":"#N/A"}},{"$f":"IF(COLUMN()>=INDIRECT(AQ28),IF(COLUMN()<=INDIRECT(AR28),INDIRECT(AS28),\"\"),\"\")","v":{"$error":"#N/A"}},{"$f":"IF(COLUMN()>=INDIRECT(AQ28),IF(COLUMN()<=INDIRECT(AR28),INDIRECT(AS28),\"\"),\"\")","v":{"$error":"#N/A"}},{"$f":"IF(COLUMN()>=INDIRECT(AQ28),IF(COLUMN()<=INDIRECT(AR28),INDIRECT(AS28),\"\"),\"\")","v":{"$error":"#N/A"}},{"$f":"IF(COLUMN()>=INDIRECT(AQ28),IF(COLUMN()<=INDIRECT(AR28),INDIRECT(AS28),\"\"),\"\")","v":{"$error":"#N/A"}},{"$f":"IF(COLUMN()>=INDIRECT(AQ28),IF(COLUMN()<=INDIRECT(AR28),INDIRECT(AS28),\"\"),\"\")","v":{"$error":"#N/A"}},{"$f":"IF(COLUMN()>=INDIRECT(AQ28),IF(COLUMN()<=INDIRECT(AR28),INDIRECT(AS28),\"\"),\"\")","v":{"$error":"#N/A"}},{"$f":"IF(COLUMN()>=INDIRECT(AQ28),IF(COLUMN()<=INDIRECT(AR28),INDIRECT(AS28),\"\"),\"\")","v":{"$error":"#N/A"}},{"$f":"IF(COLUMN()>=INDIRECT(AQ28),IF(COLUMN()<=INDIRECT(AR28),INDIRECT(AS28),\"\"),\"\")","v":{"$error":"#N/A"}},{"$f":"IF(COLUMN()>=INDIRECT(AQ28),IF(COLUMN()<=INDIRECT(AR28),INDIRECT(AS28),\"\"),\"\")","v":{"$error":"#N/A"}},{"$f":"IF(COLUMN()>=INDIRECT(AQ28),IF(COLUMN()<=INDIRECT(AR28),INDIRECT(AS28),\"\"),\"\")","v":{"$error":"#N/A"}},{"$f":"IF(COLUMN()>=INDIRECT(AQ28),IF(COLUMN()<=INDIRECT(AR28),INDIRECT(AS28),\"\"),\"\")","v":{"$error":"#N/A"}},{"$f":"IF(COLUMN()>=INDIRECT(AQ28),IF(COLUMN()<=INDIRECT(AR28),INDIRECT(AS28),\"\"),\"\")","v":{"$error":"#N/A"}},{"$f":"IF(COLUMN()>=INDIRECT(AQ28),IF(COLUMN()<=INDIRECT(AR28),INDIRECT(AS28),\"\"),\"\")","v":{"$error":"#N/A"}},{"$f":"IF(COLUMN()>=INDIRECT(AQ28),IF(COLUMN()<=INDIRECT(AR28),INDIRECT(AS28),\"\"),\"\")","v":{"$error":"#N/A"}},{"$f":"IF(COLUMN()>=INDIRECT(AQ28),IF(COLUMN()<=INDIRECT(AR28),INDIRECT(AS28),\"\"),\"\")","v":{"$error":"#N/A"}},{"$f":"IF(COLUMN()>=INDIRECT(AQ28),IF(COLUMN()<=INDIRECT(AR28),INDIRECT(AS28),\"\"),\"\")","v":{"$error":"#N/A"}},{"$f":"IF(COLUMN()>=INDIRECT(AQ28),IF(COLUMN()<=INDIRECT(AR28),INDIRECT(AS28),\"\"),\"\")","v":{"$error":"#N/A"}},{"$f":"IF(COLUMN()>=INDIRECT(AQ28),IF(COLUMN()<=INDIRECT(AR28),INDIRECT(AS28),\"\"),\"\")","v":{"$error":"#N/A"}},{"$f":"IF(COLUMN()>=INDIRECT(AQ28),IF(COLUMN()<=INDIRECT(AR28),INDIRECT(AS28),\"\"),\"\")","v":{"$error":"#N/A"}},{"$f":"IF(COLUMN()>=INDIRECT(AQ28),IF(COLUMN()<=INDIRECT(AR28),INDIRECT(AS28),\"\"),\"\")","v":{"$error":"#N/A"}},{"$f":"IF(COLUMN()>=INDIRECT(AQ28),IF(COLUMN()<=INDIRECT(AR28),INDIRECT(AS28),\"\"),\"\")","v":{"$error":"#N/A"}},null,{"$f":"CONCATENATE(\"'\",SUBSTITUTE(SUBSTITUTE(SUBSTITUTE(MID(CELL(\"direccion\",'ETAPA III.a'!M$1),FIND(\"]\",CELL(\"direccion\",'ETAPA III.a'!M$1))+1,LEN(CELL(\"direccion\",'ETAPA III.a'!M$1))),\"$\",\"\"),1,MATCH($A25,'ETAPA III.a'!$K:$K,0)),\"!\",\"!$\"))","v":"'ETAPA III.a'!$M110"},{"$f":"CONCATENATE(\"'\",SUBSTITUTE(SUBSTITUTE(SUBSTITUTE(MID(CELL(\"direccion\",'ETAPA III.a'!N$1),FIND(\"]\",CELL(\"direccion\",'ETAPA III.a'!N$1))+1,LEN(CELL(\"direccion\",'ETAPA III.a'!N$1))),\"$\",\"\"),1,MATCH($A25,'ETAPA III.a'!$K:$K,0)),\"!\",\"!$\"))","v":"'ETAPA III.a'!$N110"},{"$f":"CONCATENATE(\"'\",SUBSTITUTE(SUBSTITUTE(SUBSTITUTE(MID(CELL(\"direccion\",'ETAPA III.a'!L$1),FIND(\"]\",CELL(\"direccion\",'ETAPA III.a'!L$1))+1,LEN(CELL(\"direccion\",'ETAPA III.a'!L$1))),\"$\",\"\"),1,MATCH($A25,'ETAPA III.a'!$K:$K,0)),\"!\",\"!$\"))","v":"'ETAPA III.a'!$L110"}]
[16,{"$f":"IF(COLUMN()>=INDIRECT(AQ29),IF(COLUMN()<=INDIRECT(AR29),INDIRECT(AS29),\"\"),\"\")","v":{"$error":"#N/A"}},{"$f":"IF(COLUMN()>=INDIRECT(AQ29),IF(COLUMN()<=INDIRECT(AR29),INDIRECT(AS29),\"\"),\"\")","v":{"$error":"#N/A"}},{"$f":"IF(COLUMN()>=INDIRECT(AQ29),IF(COLUMN()<=INDIRECT(AR29),INDIRECT(AS29),\"\"),\"\")","v":{"$error":"#N/A"}},{"$f":"IF(COLUMN()>=INDIRECT(AQ29),IF(COLUMN()<=INDIRECT(AR29),INDIRECT(AS29),\"\"),\"\")","v":{"$error":"#N/A"}},{"$f":"IF(COLUMN()>=INDIRECT(AQ29),IF(COLUMN()<=INDIRECT(AR29),INDIRECT(AS29),\"\"),\"\")","v":{"$error":"#N/A"}},{"$f":"IF(COLUMN()>=INDIRECT(AQ29),IF(COLUMN()<=INDIRECT(AR29),INDIRECT(AS29),\"\"),\"\")","v":{"$error":"#N/A"}},{"$f":"IF(COLUMN()>=INDIRECT(AQ29),IF(COLUMN()<=INDIRECT(AR29),INDIRECT(AS29),\"\"),\"\")","v":{"$error":"#N/A"}},{"$f":"IF(COLUMN()>=INDIRECT(AQ29),IF(COLUMN()<=INDIRECT(AR29),INDIRECT(AS29),\"\"),\"\")","v":{"$error":"#N/A"}},{"$f":"IF(COLUMN()>=INDIRECT(AQ29),IF(COLUMN()<=INDIRECT(AR29),INDIRECT(AS29),\"\"),\"\")","v":{"$error":"#N/A"}},{"$f":"IF(COLUMN()>=INDIRECT(AQ29),IF(COLUMN()<=INDIRECT(AR29),INDIRECT(AS29),\"\"),\"\")","v":{"$error":"#N/A"}},{"$f":"IF(COLUMN()>=INDIRECT(AQ29),IF(COLUMN()<=INDIRECT(AR29),INDIRECT(AS29),\"\"),\"\")","v":{"$error":"#N/A"}},{"$f":"IF(COLUMN()>=INDIRECT(AQ29),IF(COLUMN()<=INDIRECT(AR29),INDIRECT(AS29),\"\"),\"\")","v":{"$error":"#N/A"}},{"$f":"IF(COLUMN()>=INDIRECT(AQ29),IF(COLUMN()<=INDIRECT(AR29),INDIRECT(AS29),\"\"),\"\")","v":{"$error":"#N/A"}},{"$f":"IF(COLUMN()>=INDIRECT(AQ29),IF(COLUMN()<=INDIRECT(AR29),INDIRECT(AS29),\"\"),\"\")","v":{"$error":"#N/A"}},{"$f":"IF(COLUMN()>=INDIRECT(AQ29),IF(COLUMN()<=INDIRECT(AR29),INDIRECT(AS29),\"\"),\"\")","v":{"$error":"#N/A"}},{"$f":"IF(COLUMN()>=INDIRECT(AQ29),IF(COLUMN()<=INDIRECT(AR29),INDIRECT(AS29),\"\"),\"\")","v":{"$error":"#N/A"}},{"$f":"IF(COLUMN()>=INDIRECT(AQ29),IF(COLUMN()<=INDIRECT(AR29),INDIRECT(AS29),\"\"),\"\")","v":{"$error":"#N/A"}},{"$f":"IF(COLUMN()>=INDIRECT(AQ29),IF(COLUMN()<=INDIRECT(AR29),INDIRECT(AS29),\"\"),\"\")","v":{"$error":"#N/A"}},{"$f":"IF(COLUMN()>=INDIRECT(AQ29),IF(COLUMN()<=INDIRECT(AR29),INDIRECT(AS29),\"\"),\"\")","v":{"$error":"#N/A"}},{"$f":"IF(COLUMN()>=INDIRECT(AQ29),IF(COLUMN()<=INDIRECT(AR29),INDIRECT(AS29),\"\"),\"\")","v":{"$error":"#N/A"}},{"$f":"IF(COLUMN()>=INDIRECT(AQ29),IF(COLUMN()<=INDIRECT(AR29),INDIRECT(AS29),\"\"),\"\")","v":{"$error":"#N/A"}},{"$f":"IF(COLUMN()>=INDIRECT(AQ29),IF(COLUMN()<=INDIRECT(AR29),INDIRECT(AS29),\"\"),\"\")","v":{"$error":"#N/A"}},{"$f":"IF(COLUMN()>=INDIRECT(AQ29),IF(COLUMN()<=INDIRECT(AR29),INDIRECT(AS29),\"\"),\"\")","v":{"$error":"#N/A"}},{"$f":"IF(COLUMN()>=INDIRECT(AQ29),IF(COLUMN()<=INDIRECT(AR29),INDIRECT(AS29),\"\"),\"\")","v":{"$error":"#N/A"}},{"$f":"IF(COLUMN()>=INDIRECT(AQ29),IF(COLUMN()<=INDIRECT(AR29),INDIRECT(AS29),\"\"),\"\")","v":{"$error":"#N/A"}},{"$f":"IF(COLUMN()>=INDIRECT(AQ29),IF(COLUMN()<=INDIRECT(AR29),INDIRECT(AS29),\"\"),\"\")","v":{"$error":"#N/A"}},{"$f":"IF(COLUMN()>=INDIRECT(AQ29),IF(COLUMN()<=INDIRECT(AR29),INDIRECT(AS29),\"\"),\"\")","v":{"$error":"#N/A"}},{"$f":"IF(COLUMN()>=INDIRECT(AQ29),IF(COLUMN()<=INDIRECT(AR29),INDIRECT(AS29),\"\"),\"\")","v":{"$error":"#N/A"}},{"$f":"IF(COLUMN()>=INDIRECT(AQ29),IF(COLUMN()<=INDIRECT(AR29),INDIRECT(AS29),\"\"),\"\")","v":{"$error":"#N/A"}},{"$f":"IF(COLUMN()>=INDIRECT(AQ29),IF(COLUMN()<=INDIRECT(AR29),INDIRECT(AS29),\"\"),\"\")","v":{"$error":"#N/A"}},{"$f":"IF(COLUMN()>=INDIRECT(AQ29),IF(COLUMN()<=INDIRECT(AR29),INDIRECT(AS29),\"\"),\"\")","v":{"$error":"#N/A"}},{"$f":"IF(COLUMN()>=INDIRECT(AQ29),IF(COLUMN()<=INDIRECT(AR29),INDIRECT(AS29),\"\"),\"\")","v":{"$error":"#N/A"}},{"$f":"IF(COLUMN()>=INDIRECT(AQ29),IF(COLUMN()<=INDIRECT(AR29),INDIRECT(AS29),\"\"),\"\")","v":{"$error":"#N/A"}},{"$f":"IF(COLUMN()>=INDIRECT(AQ29),IF(COLUMN()<=INDIRECT(AR29),INDIRECT(AS29),\"\"),\"\")","v":{"$error":"#N/A"}},{"$f":"IF(COLUMN()>=INDIRECT(AQ29),IF(COLUMN()<=INDIRECT(AR29),INDIRECT(AS29),\"\"),\"\")","v":{"$error":"#N/A"}},{"$f":"IF(COLUMN()>=INDIRECT(AQ29),IF(COLUMN()<=INDIRECT(AR29),INDIRECT(AS29),\"\"),\"\")","v":{"$error":"#N/A"}},{"$f":"IF(COLUMN()>=INDIRECT(AQ29),IF(COLUMN()<=INDIRECT(AR29),INDIRECT(AS29),\"\"),\"\")","v":{"$error":"#N/A"}},{"$f":"IF(COLUMN()>=INDIRECT(AQ29),IF(COLUMN()<=INDIRECT(AR29),INDIRECT(AS29),\"\"),\"\")","v":{"$error":"#N/A"}},{"$f":"IF(COLUMN()>=INDIRECT(AQ29),IF(COLUMN()<=INDIRECT(AR29),INDIRECT(AS29),\"\"),\"\")","v":{"$error":"#N/A"}},{"$f":"IF(COLUMN()>=INDIRECT(AQ29),IF(COLUMN()<=INDIRECT(AR29),INDIRECT(AS29),\"\"),\"\")","v":{"$error":"#N/A"}},null,{"$f":"CONCATENATE(\"'\",SUBSTITUTE(SUBSTITUTE(SUBSTITUTE(MID(CELL(\"direccion\",'ETAPA III.a'!M$1),FIND(\"]\",CELL(\"direccion\",'ETAPA III.a'!M$1))+1,LEN(CELL(\"direccion\",'ETAPA III.a'!M$1))),\"$\",\"\"),1,MATCH($A26,'ETAPA III.a'!$K:$K,0)),\"!\",\"!$\"))","v":"'ETAPA III.a'!$M117"},{"$f":"CONCATENATE(\"'\",SUBSTITUTE(SUBSTITUTE(SUBSTITUTE(MID(CELL(\"direccion\",'ETAPA III.a'!N$1),FIND(\"]\",CELL(\"direccion\",'ETAPA III.a'!N$1))+1,LEN(CELL(\"direccion\",'ETAPA III.a'!N$1))),\"$\",\"\"),1,MATCH($A26,'ETAPA III.a'!$K:$K,0)),\"!\",\"!$\"))","v":"'ETAPA III.a'!$N117"},{"$f":"CONCATENATE(\"'\",SUBSTITUTE(SUBSTITUTE(SUBSTITUTE(MID(CELL(\"direccion\",'ETAPA III.a'!L$1),FIND(\"]\",CELL(\"direccion\",'ETAPA III.a'!L$1))+1,LEN(CELL(\"direccion\",'ETAPA III.a'!L$1))),\"$\",\"\"),1,MATCH($A26,'ETAPA III.a'!$K:$K,0)),\"!\",\"!$\"))","v":"'ETAPA III.a'!$L117"}]
[17,{"$f":"IF(COLUMN()>=INDIRECT(AQ30),IF(COLUMN()<=INDIRECT(AR30),INDIRECT(AS30),\"\"),\"\")","v":{"$error":"#N/A"}},{"$f":"IF(COLUMN()>=INDIRECT(AQ30),IF(COLUMN()<=INDIRECT(AR30),INDIRECT(AS30),\"\"),\"\")","v":{"$error":"#N/A"}},{"$f":"IF(COLUMN()>=INDIRECT(AQ30),IF(COLUMN()<=INDIRECT(AR30),INDIRECT(AS30),\"\"),\"\")","v":{"$error":"#N/A"}},{"$f":"IF(COLUMN()>=INDIRECT(AQ30),IF(COLUMN()<=INDIRECT(AR30),INDIRECT(AS30),\"\"),\"\")","v":{"$error":"#N/A"}},{"$f":"IF(COLUMN()>=INDIRECT(AQ30),IF(COLUMN()<=INDIRECT(AR30),INDIRECT(AS30),\"\"),\"\")","v":{"$error":"#N/A"}},{"$f":"IF(COLUMN()>=INDIRECT(AQ30),IF(COLUMN()<=INDIRECT(AR30),INDIRECT(AS30),\"\"),\"\")","v":{"$error":"#N/A"}},{"$f":"IF(COLUMN()>=INDIRECT(AQ30),IF(COLUMN()<=INDIRECT(AR30),INDIRECT(AS30),\"\"),\"\")","v":{"$error":"#N/A"}},{"$f":"IF(COLUMN()>=INDIRECT(AQ30),IF(COLUMN()<=INDIRECT(AR30),INDIRECT(AS30),\"\"),\"\")","v":{"$error":"#N/A"}},{"$f":"IF(COLUMN()>=INDIRECT(AQ30),IF(COLUMN()<=INDIRECT(AR30),INDIRECT(AS30),\"\"),\"\")","v":{"$error":"#N/A"}},{"$f":"IF(COLUMN()>=INDIRECT(AQ30),IF(COLUMN()<=INDIRECT(AR30),INDIRECT(AS30),\"\"),\"\")","v":{"$error":"#N/A"}},{"$f":"IF(COLUMN()>=INDIRECT(AQ30),IF(COLUMN()<=INDIRECT(AR30),INDIRECT(AS30),\"\"),\"\")","v":{"$error":"#N/A"}},{"$f":"IF(COLUMN()>=INDIRECT(AQ30),IF(COLUMN()<=INDIRECT(AR30),INDIRECT(AS30),\"\"),\"\")","v":{"$error":"#N/A"}},{"$f":"IF(COLUMN()>=INDIRECT(AQ30),IF(COLUMN()<=INDIRECT(AR30),INDIRECT(AS30),\"\"),\"\")","v":{"$error":"#N/A"}},{"$f":"IF(COLUMN()>=INDIRECT(AQ30),IF(COLUMN()<=INDIRECT(AR30),INDIRECT(AS30),\"\"),\"\")","v":{"$error":"#N/A"}},{"$f":"IF(COLUMN()>=INDIRECT(AQ30),IF(COLUMN()<=INDIRECT(AR30),INDIRECT(AS30),\"\"),\"\")","v":{"$error":"#N/A"}},{"$f":"IF(COLUMN()>=INDIRECT(AQ30),IF(COLUMN()<=INDIRECT(AR30),INDIRECT(AS30),\"\"),\"\")","v":{"$error":"#N/A"}},{"$f":"IF(COLUMN()>=INDIRECT(AQ30),IF(COLUMN()<=INDIRECT(AR30),INDIRECT(AS30),\"\"),\"\")","v":{"$error":"#N/A"}},{"$f":"IF(COLUMN()>=INDIRECT(AQ30),IF(COLUMN()<=INDIRECT(AR30),INDIRECT(AS30),\"\"),\"\")","v":{"$error":"#N/A"}},{"$f":"IF(COLUMN()>=INDIRECT(AQ30),IF(COLUMN()<=INDIRECT(AR30),INDIRECT(AS30),\"\"),\"\")","v":{"$error":"#N/A"}},{"$f":"IF(COLUMN()>=INDIRECT(AQ30),IF(COLUMN()<=INDIRECT(AR30),INDIRECT(AS30),\"\"),\"\")","v":{"$error":"#N/A"}},{"$f":"IF(COLUMN()>=INDIRECT(AQ30),IF(COLUMN()<=INDIRECT(AR30),INDIRECT(AS30),\"\"),\"\")","v":{"$error":"#N/A"}},{"$f":"IF(COLUMN()>=INDIRECT(AQ30),IF(COLUMN()<=INDIRECT(AR30),INDIRECT(AS30),\"\"),\"\")","v":{"$error":"#N/A"}},{"$f":"IF(COLUMN()>=INDIRECT(AQ30),IF(COLUMN()<=INDIRECT(AR30),INDIRECT(AS30),\"\"),\"\")","v":{"$error":"#N/A"}},{"$f":"IF(COLUMN()>=INDIRECT(AQ30),IF(COLUMN()<=INDIRECT(AR30),INDIRECT(AS30),\"\"),\"\")","v":{"$error":"#N/A"}},{"$f":"IF(COLUMN()>=INDIRECT(AQ30),IF(COLUMN()<=INDIRECT(AR30),INDIRECT(AS30),\"\"),\"\")","v":{"$error":"#N/A"}},{"$f":"IF(COLUMN()>=INDIRECT(AQ30),IF(COLUMN()<=INDIRECT(AR30),INDIRECT(AS30),\"\"),\"\")","v":{"$error":"#N/A"}},{"$f":"IF(COLUMN()>=INDIRECT(AQ30),IF(COLUMN()<=INDIRECT(AR30),INDIRECT(AS30),\"\"),\"\")","v":{"$error":"#N/A"}},{"$f":"IF(COLUMN()>=INDIRECT(AQ30),IF(COLUMN()<=INDIRECT(AR30),INDIRECT(AS30),\"\"),\"\")","v":{"$error":"#N/A"}},{"$f":"IF(COLUMN()>=INDIRECT(AQ30),IF(COLUMN()<=INDIRECT(AR30),INDIRECT(AS30),\"\"),\"\")","v":{"$error":"#N/A"}},{"$f":"IF(COLUMN()>=INDIRECT(AQ30),IF(COLUMN()<=INDIRECT(AR30),INDIRECT(AS30),\"\"),\"\")","v":{"$error":"#N/A"}},{"$f":"IF(COLUMN()>=INDIRECT(AQ30),IF(COLUMN()<=INDIRECT(AR30),INDIRECT(AS30),\"\"),\"\")","v":{"$error":"#N/A"}},{"$f":"IF(COLUMN()>=INDIRECT(AQ30),IF(COLUMN()<=INDIRECT(AR30),INDIRECT(AS30),\"\"),\"\")","v":{"$error":"#N/A"}},{"$f":"IF(COLUMN()>=INDIRECT(AQ30),IF(COLUMN()<=INDIRECT(AR30),INDIRECT(AS30),\"\"),\"\")","v":{"$error":"#N/A"}},{"$f":"IF(COLUMN()>=INDIRECT(AQ30),IF(COLUMN()<=INDIRECT(AR30),INDIRECT(AS30),\"\"),\"\")","v":{"$error":"#N/A"}},{"$f":"IF(COLUMN()>=INDIRECT(AQ30),IF(COLUMN()<=INDIRECT(AR30),INDIRECT(AS30),\"\"),\"\")","v":{"$error":"#N/A"}},{"$f":"IF(COLUMN()>=INDIRECT(AQ30),IF(COLUMN()<=INDIRECT(AR30),INDIRECT(AS30),\"\"),\"\")","v":{"$error":"#N/A"}},{"$f":"IF(COLUMN()>=INDIRECT(AQ30),IF(COLUMN()<=INDIRECT(AR30),INDIRECT(AS30),\"\"),\"\")","v":{"$error":"#N/A"}},{"$f":"IF(COLUMN()>=INDIRECT(AQ30),IF(COLUMN()<=INDIRECT(AR30),INDIRECT(AS30),\"\"),\"\")","v":{"$error":"#N/A"}},{"$f":"IF(COLUMN()>=INDIRECT(AQ30),IF(COLUMN()<=INDIRECT(AR30),INDIRECT(AS30),\"\"),\"\")","v":{"$error":"#N/A"}},{"$f":"IF(COLUMN()>=INDIRECT(AQ30),IF(COLUMN()<=INDIRECT(AR30),INDIRECT(AS30),\"\"),\"\")","v":{"$error":"#N/A"}},null,{"$f":"CONCATENATE(\"'\",SUBSTITUTE(SUBSTITUTE(SUBSTITUTE(MID(CELL(\"direccion\",'ETAPA III.a'!M$1),FIND(\"]\",CELL(\"direccion\",'ETAPA III.a'!M$1))+1,LEN(CELL(\"direccion\",'ETAPA III.a'!M$1))),\"$\",\"\"),1,MATCH($A27,'ETAPA III.a'!$K:$K,0)),\"!\",\"!$\"))","v":"'ETAPA III.a'!$M124"},{"$f":"CONCATENATE(\"'\",SUBSTITUTE(SUBSTITUTE(SUBSTITUTE(MID(CELL(\"direccion\",'ETAPA III.a'!N$1),FIND(\"]\",CELL(\"direccion\",'ETAPA III.a'!N$1))+1,LEN(CELL(\"direccion\",'ETAPA III.a'!N$1))),\"$\",\"\"),1,MATCH($A27,'ETAPA III.a'!$K:$K,0)),\"!\",\"!$\"))","v":"'ETAPA III.a'!$N124"},{"$f":"CONCATENATE(\"'\",SUBSTITUTE(SUBSTITUTE(SUBSTITUTE(MID(CELL(\"direccion\",'ETAPA III.a'!L$1),FIND(\"]\",CELL(\"direccion\",'ETAPA III.a'!L$1))+1,LEN(CELL(\"direccion\",'ETAPA III.a'!L$1))),\"$\",\"\"),1,MATCH($A27,'ETAPA III.a'!$K:$K,0)),\"!\",\"!$\"))","v":"'ETAPA III.a'!$L124"}]
[18,{"$f":"IF(COLUMN()>=INDIRECT(AQ31),IF(COLUMN()<=INDIRECT(AR31),INDIRECT(AS31),\"\"),\"\")","v":{"$error":"#N/A"}},{"$f":"IF(COLUMN()>=INDIRECT(AQ31),IF(COLUMN()<=INDIRECT(AR31),INDIRECT(AS31),\"\"),\"\")","v":{"$error":"#N/A"}},{"$f":"IF(COLUMN()>=INDIRECT(AQ31),IF(COLUMN()<=INDIRECT(AR31),INDIRECT(AS31),\"\"),\"\")","v":{"$error":"#N/A"}},{"$f":"IF(COLUMN()>=INDIRECT(AQ31),IF(COLUMN()<=INDIRECT(AR31),INDIRECT(AS31),\"\"),\"\")","v":{"$error":"#N/A"}},{"$f":"IF(COLUMN()>=INDIRECT(AQ31),IF(COLUMN()<=INDIRECT(AR31),INDIRECT(AS31),\"\"),\"\")","v":{"$error":"#N/A"}},{"$f":"IF(COLUMN()>=INDIRECT(AQ31),IF(COLUMN()<=INDIRECT(AR31),INDIRECT(AS31),\"\"),\"\")","v":{"$error":"#N/A"}},{"$f":"IF(COLUMN()>=INDIRECT(AQ31),IF(COLUMN()<=INDIRECT(AR31),INDIRECT(AS31),\"\"),\"\")","v":{"$error":"#N/A"}},{"$f":"IF(COLUMN()>=INDIRECT(AQ31),IF(COLUMN()<=INDIRECT(AR31),INDIRECT(AS31),\"\"),\"\")","v":{"$error":"#N/A"}},{"$f":"IF(COLUMN()>=INDIRECT(AQ31),IF(COLUMN()<=INDIRECT(AR31),INDIRECT(AS31),\"\"),\"\")","v":{"$error":"#N/A"}},{"$f":"IF(COLUMN()>=INDIRECT(AQ31),IF(COLUMN()<=INDIRECT(AR31),INDIRECT(AS31),\"\"),\"\")","v":{"$error":"#N/A"}},{"$f":"IF(COLUMN()>=INDIRECT(AQ31),IF(COLUMN()<=INDIRECT(AR31),INDIRECT(AS31),\"\"),\"\")","v":{"$error":"#N/A"}},{"$f":"IF(COLUMN()>=INDIRECT(AQ31),IF(COLUMN()<=INDIRECT(AR31),INDIRECT(AS31),\"\"),\"\")","v":{"$error":"#N/A"}},{"$f":"IF(COLUMN()>=INDIRECT(AQ31),IF(COLUMN()<=INDIRECT(AR31),INDIRECT(AS31),\"\"),\"\")","v":{"$error":"#N/A"}},{"$f":"IF(COLUMN()>=INDIRECT(AQ31),IF(COLUMN()<=INDIRECT(AR31),INDIRECT(AS31),\"\"),\"\")","v":{"$error":"#N/A"}},{"$f":"IF(COLUMN()>=INDIRECT(AQ31),IF(COLUMN()<=INDIRECT(AR31),INDIRECT(AS31),\"\"),\"\")","v":{"$error":"#N/A"}},{"$f":"IF(COLUMN()>=INDIRECT(AQ31),IF(COLUMN()<=INDIRECT(AR31),INDIRECT(AS31),\"\"),\"\")","v":{"$error":"#N/A"}},{"$f":"IF(COLUMN()>=INDIRECT(AQ31),IF(COLUMN()<=INDIRECT(AR31),INDIRECT(AS31),\"\"),\"\")","v":{"$error":"#N/A"}},{"$f":"IF(COLUMN()>=INDIRECT(AQ31),IF(COLUMN()<=INDIRECT(AR31),INDIRECT(AS31),\"\"),\"\")","v":{"$error":"#N/A"}},{"$f":"IF(COLUMN()>=INDIRECT(AQ31),IF(COLUMN()<=INDIRECT(AR31),INDIRECT(AS31),\"\"),\"\")","v":{"$error":"#N/A"}},{"$f":"IF(COLUMN()>=INDIRECT(AQ31),IF(COLUMN()<=INDIRECT(AR31),INDIRECT(AS31),\"\"),\"\")","v":{"$error":"#N/A"}},{"$f":"IF(COLUMN()>=INDIRECT(AQ31),IF(COLUMN()<=INDIRECT(AR31),INDIRECT(AS31),\"\"),\"\")","v":{"$error":"#N/A"}},{"$f":"IF(COLUMN()>=INDIRECT(AQ31),IF(COLUMN()<=INDIRECT(AR31),INDIRECT(AS31),\"\"),\"\")","v":{"$error":"#N/A"}},{"$f":"IF(COLUMN()>=INDIRECT(AQ31),IF(COLUMN()<=INDIRECT(AR31),INDIRECT(AS31),\"\"),\"\")","v":{"$error":"#N/A"}},{"$f":"IF(COLUMN()>=INDIRECT(AQ31),IF(COLUMN()<=INDIRECT(AR31),INDIRECT(AS31),\"\"),\"\")","v":{"$error":"#N/A"}},{"$f":"IF(COLUMN()>=INDIRECT(AQ31),IF(COLUMN()<=INDIRECT(AR31),INDIRECT(AS31),\"\"),\"\")","v":{"$error":"#N/A"}},{"$f":"IF(COLUMN()>=INDIRECT(AQ31),IF(COLUMN()<=INDIRECT(AR31),INDIRECT(AS31),\"\"),\"\")","v":{"$error":"#N/A"}},{"$f":"IF(COLUMN()>=INDIRECT(AQ31),IF(COLUMN()<=INDIRECT(AR31),INDIRECT(AS31),\"\"),\"\")","v":{"$error":"#N/A"}},{"$f":"IF(COLUMN()>=INDIRECT(AQ31),IF(COLUMN()<=INDIRECT(AR31),INDIRECT(AS31),\"\"),\"\")","v":{"$error":"#N/A"}},{"$f":"IF(COLUMN()>=INDIRECT(AQ31),IF(COLUMN()<=INDIRECT(AR31),INDIRECT(AS31),\"\"),\"\")","v":{"$error":"#N/A"}},{"$f":"IF(COLUMN()>=INDIRECT(AQ31),IF(COLUMN()<=INDIRECT(AR31),INDIRECT(AS31),\"\"),\"\")","v":{"$error":"#N/A"}},{"$f":"IF(COLUMN()>=INDIRECT(AQ31),IF(COLUMN()<=INDIRECT(AR31),INDIRECT(AS31),\"\"),\"\")","v":{"$error":"#N/A"}},{"$f":"IF(COLUMN()>=INDIRECT(AQ31),IF(COLUMN()<=INDIRECT(AR31),INDIRECT(AS31),\"\"),\"\")","v":{"$error":"#N/A"}},{"$f":"IF(COLUMN()>=INDIRECT(AQ31),IF(COLUMN()<=INDIRECT(AR31),INDIRECT(AS31),\"\"),\"\")","v":{"$error":"#N/A"}},{"$f":"IF(COLUMN()>=INDIRECT(AQ31),IF(COLUMN()<=INDIRECT(AR31),INDIRECT(AS31),\"\"),\"\")","v":{"$error":"#N/A"}},{"$f":"IF(COLUMN()>=INDIRECT(AQ31),IF(COLUMN()<=INDIRECT(AR31),INDIRECT(AS31),\"\"),\"\")","v":{"$error":"#N/A"}},{"$f":"IF(COLUMN()>=INDIRECT(AQ31),IF(COLUMN()<=INDIRECT(AR31),INDIRECT(AS31),\"\"),\"\")","v":{"$error":"#N/A"}},{"$f":"IF(COLUMN()>=INDIRECT(AQ31),IF(COLUMN()<=INDIRECT(AR31),INDIRECT(AS31),\"\"),\"\")","v":{"$error":"#N/A"}},{"$f":"IF(COLUMN()>=INDIRECT(AQ31),IF(COLUMN()<=INDIRECT(AR31),INDIRECT(AS31),\"\"),\"\")","v":{"$error":"#N/A"}},{"$f":"IF(COLUMN()>=INDIRECT(AQ31),IF(COLUMN()<=INDIRECT(AR31),INDIRECT(AS31),\"\"),\"\")","v":{"$error":"#N/A"}},{"$f":"IF(COLUMN()>=INDIRECT(AQ31),IF(COLUMN()<=INDIRECT(AR31),INDIRECT(AS31),\"\"),\"\")","v":{"$error":"#N/A"}},null,{"$f":"CONCATENATE(\"'\",SUBSTITUTE(SUBSTITUTE(SUBSTITUTE(MID(CELL(\"direccion\",'ETAPA III.a'!M$1),FIND(\"]\",CELL(\"direccion\",'ETAPA III.a'!M$1))+1,LEN(CELL(\"direccion\",'ETAPA III.a'!M$1))),\"$\",\"\"),1,MATCH($A28,'ETAPA III.a'!$K:$K,0)),\"!\",\"!$\"))","v":"'ETAPA III.a'!$M131"},{"$f":"CONCATENATE(\"'\",SUBSTITUTE(SUBSTITUTE(SUBSTITUTE(MID(CELL(\"direccion\",'ETAPA III.a'!N$1),FIND(\"]\",CELL(\"direccion\",'ETAPA III.a'!N$1))+1,LEN(CELL(\"direccion\",'ETAPA III.a'!N$1))),\"$\",\"\"),1,MATCH($A28,'ETAPA III.a'!$K:$K,0)),\"!\",\"!$\"))","v":"'ETAPA III.a'!$N131"},{"$f":"CONCATENATE(\"'\",SUBSTITUTE(SUBSTITUTE(SUBSTITUTE(MID(CELL(\"direccion\",'ETAPA III.a'!L$1),FIND(\"]\",CELL(\"direccion\",'ETAPA III.a'!L$1))+1,LEN(CELL(\"direccion\",'ETAPA III.a'!L$1))),\"$\",\"\"),1,MATCH($A28,'ETAPA III.a'!$K:$K,0)),\"!\",\"!$\"))","v":"'ETAPA III.a'!$L131"}]
[19,{"$f":"IF(COLUMN()>=INDIRECT(AQ32),IF(COLUMN()<=INDIRECT(AR32),INDIRECT(AS32),\"\"),\"\")","v":{"$error":"#N/A"}},{"$f":"IF(COLUMN()>=INDIRECT(AQ32),IF(COLUMN()<=INDIRECT(AR32),INDIRECT(AS32),\"\"),\"\")","v":{"$error":"#N/A"}},{"$f":"IF(COLUMN()>=INDIRECT(AQ32),IF(COLUMN()<=INDIRECT(AR32),INDIRECT(AS32),\"\"),\"\")","v":{"$error":"#N/A"}},{"$f":"IF(COLUMN()>=INDIRECT(AQ32),IF(COLUMN()<=INDIRECT(AR32),INDIRECT(AS32),\"\"),\"\")","v":{"$error":"#N/A"}},{"$f":"IF(COLUMN()>=INDIRECT(AQ32),IF(COLUMN()<=INDIRECT(AR32),INDIRECT(AS32),\"\"),\"\")","v":{"$error":"#N/A"}},{"$f":"IF(COLUMN()>=INDIRECT(AQ32),IF(COLUMN()<=INDIRECT(AR32),INDIRECT(AS32),\"\"),\"\")","v":{"$error":"#N/A"}},{"$f":"IF(COLUMN()>=INDIRECT(AQ32),IF(COLUMN()<=INDIRECT(AR32),INDIRECT(AS32),\"\"),\"\")","v":{"$error":"#N/A"}},{"$f":"IF(COLUMN()>=INDIRECT(AQ32),IF(COLUMN()<=INDIRECT(AR32),INDIRECT(AS32),\"\"),\"\")","v":{"$error":"#N/A"}},{"$f":"IF(COLUMN()>=INDIRECT(AQ32),IF(COLUMN()<=INDIRECT(AR32),INDIRECT(AS32),\"\"),\"\")","v":{"$error":"#N/A"}},{"$f":"IF(COLUMN()>=INDIRECT(AQ32),IF(COLUMN()<=INDIRECT(AR32),INDIRECT(AS32),\"\"),\"\")","v":{"$error":"#N/A"}},{"$f":"IF(COLUMN()>=INDIRECT(AQ32),IF(COLUMN()<=INDIRECT(AR32),INDIRECT(AS32),\"\"),\"\")","v":{"$error":"#N/A"}},{"$f":"IF(COLUMN()>=INDIRECT(AQ32),IF(COLUMN()<=INDIRECT(AR32),INDIRECT(AS32),\"\"),\"\")","v":{"$error":"#N/A"}},{"$f":"IF(COLUMN()>=INDIRECT(AQ32),IF(COLUMN()<=INDIRECT(AR32),INDIRECT(AS32),\"\"),\"\")","v":{"$error":"#N/A"}},{"$f":"IF(COLUMN()>=INDIRECT(AQ32),IF(COLUMN()<=INDIRECT(AR32),INDIRECT(AS32),\"\"),\"\")","v":{"$error":"#N/A"}},{"$f":"IF(COLUMN()>=INDIRECT(AQ32),IF(COLUMN()<=INDIRECT(AR32),INDIRECT(AS32),\"\"),\"\")","v":{"$error":"#N/A"}},{"$f":"IF(COLUMN()>=INDIRECT(AQ32),IF(COLUMN()<=INDIRECT(AR32),INDIRECT(AS32),\"\"),\"\")","v":{"$error":"#N/A"}},{"$f":"IF(COLUMN()>=INDIRECT(AQ32),IF(COLUMN()<=INDIRECT(AR32),INDIRECT(AS32),\"\"),\"\")","v":{"$error":"#N/A"}},{"$f":"IF(COLUMN()>=INDIRECT(AQ32),IF(COLUMN()<=INDIRECT(AR32),INDIRECT(AS32),\"\"),\"\")","v":{"$error":"#N/A"}},{"$f":"IF(COLUMN()>=INDIRECT(AQ32),IF(COLUMN()<=INDIRECT(AR32),INDIRECT(AS32),\"\"),\"\")","v":{"$error":"#N/A"}},{"$f":"IF(COLUMN()>=INDIRECT(AQ32),IF(COLUMN()<=INDIRECT(AR32),INDIRECT(AS32),\"\"),\"\")","v":{"$error":"#N/A"}},{"$f":"IF(COLUMN()>=INDIRECT(AQ32),IF(COLUMN()<=INDIRECT(AR32),INDIRECT(AS32),\"\"),\"\")","v":{"$error":"#N/A"}},{"$f":"IF(COLUMN()>=INDIRECT(AQ32),IF(COLUMN()<=INDIRECT(AR32),INDIRECT(AS32),\"\"),\"\")","v":{"$error":"#N/A"}},{"$f":"IF(COLUMN()>=INDIRECT(AQ32),IF(COLUMN()<=INDIRECT(AR32),INDIRECT(AS32),\"\"),\"\")","v":{"$error":"#N/A"}},{"$f":"IF(COLUMN()>=INDIRECT(AQ32),IF(COLUMN()<=INDIRECT(AR32),INDIRECT(AS32),\"\"),\"\")","v":{"$error":"#N/A"}},{"$f":"IF(COLUMN()>=INDIRECT(AQ32),IF(COLUMN()<=INDIRECT(AR32),INDIRECT(AS32),\"\"),\"\")","v":{"$error":"#N/A"}},{"$f":"IF(COLUMN()>=INDIRECT(AQ32),IF(COLUMN()<=INDIRECT(AR32),INDIRECT(AS32),\"\"),\"\")","v":{"$error":"#N/A"}},{"$f":"IF(COLUMN()>=INDIRECT(AQ32),IF(COLUMN()<=INDIRECT(AR32),INDIRECT(AS32),\"\"),\"\")","v":{"$error":"#N/A"}},{"$f":"IF(COLUMN()>=INDIRECT(AQ32),IF(COLUMN()<=INDIRECT(AR32),INDIRECT(AS32),\"\"),\"\")","v":{"$error":"#N/A"}},{"$f":"IF(COLUMN()>=INDIRECT(AQ32),IF(COLUMN()<=INDIRECT(AR32),INDIRECT(AS32),\"\"),\"\")","v":{"$error":"#N/A"}},{"$f":"IF(COLUMN()>=INDIRECT(AQ32),IF(COLUMN()<=INDIRECT(AR32),INDIRECT(AS32),\"\"),\"\")","v":{"$error":"#N/A"}},{"$f":"IF(COLUMN()>=INDIRECT(AQ32),IF(COLUMN()<=INDIRECT(AR32),INDIRECT(AS32),\"\"),\"\")","v":{"$error":"#N/A"}},{"$f":"IF(COLUMN()>=INDIRECT(AQ32),IF(COLUMN()<=INDIRECT(AR32),INDIRECT(AS32),\"\"),\"\")","v":{"$error":"#N/A"}},{"$f":"IF(COLUMN()>=INDIRECT(AQ32),IF(COLUMN()<=INDIRECT(AR32),INDIRECT(AS32),\"\"),\"\")","v":{"$error":"#N/A"}},{"$f":"IF(COLUMN()>=INDIRECT(AQ32),IF(COLUMN()<=INDIRECT(AR32),INDIRECT(AS32),\"\"),\"\")","v":{"$error":"#N/A"}},{"$f":"IF(COLUMN()>=INDIRECT(AQ32),IF(COLUMN()<=INDIRECT(AR32),INDIRECT(AS32),\"\"),\"\")","v":{"$error":"#N/A"}},{"$f":"IF(COLUMN()>=INDIRECT(AQ32),IF(COLUMN()<=INDIRECT(AR32),INDIRECT(AS32),\"\"),\"\")","v":{"$error":"#N/A"}},{"$f":"IF(COLUMN()>=INDIRECT(AQ32),IF(COLUMN()<=INDIRECT(AR32),INDIRECT(AS32),\"\"),\"\")","v":{"$error":"#N/A"}},{"$f":"IF(COLUMN()>=INDIRECT(AQ32),IF(COLUMN()<=INDIRECT(AR32),INDIRECT(AS32),\"\"),\"\")","v":{"$error":"#N/A"}},{"$f":"IF(COLUMN()>=INDIRECT(AQ32),IF(COLUMN()<=INDIRECT(AR32),INDIRECT(AS32),\"\"),\"\")","v":{"$error":"#N/A"}},{"$f":"IF(COLUMN()>=INDIRECT(AQ32),IF(COLUMN()<=INDIRECT(AR32),INDIRECT(AS32),\"\"),\"\")","v":{"$error":"#N/A"}},null,{"$f":"CONCATENATE(\"'\",SUBSTITUTE(SUBSTITUTE(SUBSTITUTE(MID(CELL(\"direccion\",'ETAPA III.a'!M$1),FIND(\"]\",CELL(\"direccion\",'ETAPA III.a'!M$1))+1,LEN(CELL(\"direccion\",'ETAPA III.a'!M$1))),\"$\",\"\"),1,MATCH($A29,'ETAPA III.a'!$K:$K,0)),\"!\",\"!$\"))","v":"'ETAPA III.a'!$M141"},{"$f":"CONCATENATE(\"'\",SUBSTITUTE(SUBSTITUTE(SUBSTITUTE(MID(CELL(\"direccion\",'ETAPA III.a'!N$1),FIND(\"]\",CELL(\"direccion\",'ETAPA III.a'!N$1))+1,LEN(CELL(\"direccion\",'ETAPA III.a'!N$1))),\"$\",\"\"),1,MATCH($A29,'ETAPA III.a'!$K:$K,0)),\"!\",\"!$\"))","v":"'ETAPA III.a'!$N141"},{"$f":"CONCATENATE(\"'\",SUBSTITUTE(SUBSTITUTE(SUBSTITUTE(MID(CELL(\"direccion\",'ETAPA III.a'!L$1),FIND(\"]\",CELL(\"direccion\",'ETAPA III.a'!L$1))+1,LEN(CELL(\"direccion\",'ETAPA III.a'!L$1))),\"$\",\"\"),1,MATCH($A29,'ETAPA III.a'!$K:$K,0)),\"!\",\"!$\"))","v":"'ETAPA III.a'!$L141"}]
[20,{"$f":"IF(COLUMN()>=INDIRECT(AQ33),IF(COLUMN()<=INDIRECT(AR33),INDIRECT(AS33),\"\"),\"\")","v":{"$error":"#N/A"}},{"$f":"IF(COLUMN()>=INDIRECT(AQ33),IF(COLUMN()<=INDIRECT(AR33),INDIRECT(AS33),\"\"),\"\")","v":{"$error":"#N/A"}},{"$f":"IF(COLUMN()>=INDIRECT(AQ33),IF(COLUMN()<=INDIRECT(AR33),INDIRECT(AS33),\"\"),\"\")","v":{"$error":"#N/A"}},{"$f":"IF(COLUMN()>=INDIRECT(AQ33),IF(COLUMN()<=INDIRECT(AR33),INDIRECT(AS33),\"\"),\"\")","v":{"$error":"#N/A"}},{"$f":"IF(COLUMN()>=INDIRECT(AQ33),IF(COLUMN()<=INDIRECT(AR33),INDIRECT(AS33),\"\"),\"\")","v":{"$error":"#N/A"}},{"$f":"IF(COLUMN()>=INDIRECT(AQ33),IF(COLUMN()<=INDIRECT(AR33),INDIRECT(AS33),\"\"),\"\")","v":{"$error":"#N/A"}},{"$f":"IF(COLUMN()>=INDIRECT(AQ33),IF(COLUMN()<=INDIRECT(AR33),INDIRECT(AS33),\"\"),\"\")","v":{"$error":"#N/A"}},{"$f":"IF(COLUMN()>=INDIRECT(AQ33),IF(COLUMN()<=INDIRECT(AR33),INDIRECT(AS33),\"\"),\"\")","v":{"$error":"#N/A"}},{"$f":"IF(COLUMN()>=INDIRECT(AQ33),IF(COLUMN()<=INDIRECT(AR33),INDIRECT(AS33),\"\"),\"\")","v":{"$error":"#N/A"}},{"$f":"IF(COLUMN()>=INDIRECT(AQ33),IF(COLUMN()<=INDIRECT(AR33),INDIRECT(AS33),\"\"),\"\")","v":{"$error":"#N/A"}},{"$f":"IF(COLUMN()>=INDIRECT(AQ33),IF(COLUMN()<=INDIRECT(AR33),INDIRECT(AS33),\"\"),\"\")","v":{"$error":"#N/A"}},{"$f":"IF(COLUMN()>=INDIRECT(AQ33),IF(COLUMN()<=INDIRECT(AR33),INDIRECT(AS33),\"\"),\"\")","v":{"$error":"#N/A"}},{"$f":"IF(COLUMN()>=INDIRECT(AQ33),IF(COLUMN()<=INDIRECT(AR33),INDIRECT(AS33),\"\"),\"\")","v":{"$error":"#N/A"}},{"$f":"IF(COLUMN()>=INDIRECT(AQ33),IF(COLUMN()<=INDIRECT(AR33),INDIRECT(AS33),\"\"),\"\")","v":{"$error":"#N/A"}},{"$f":"IF(COLUMN()>=INDIRECT(AQ33),IF(COLUMN()<=INDIRECT(AR33),INDIRECT(AS33),\"\"),\"\")","v":{"$error":"#N/A"}},{"$f":"IF(COLUMN()>=INDIRECT(AQ33),IF(COLUMN()<=INDIRECT(AR33),INDIRECT(AS33),\"\"),\"\")","v":{"$error":"#N/A"}},{"$f":"IF(COLUMN()>=INDIRECT(AQ33),IF(COLUMN()<=INDIRECT(AR33),INDIRECT(AS33),\"\"),\"\")","v":{"$error":"#N/A"}},{"$f":"IF(COLUMN()>=INDIRECT(AQ33),IF(COLUMN()<=INDIRECT(AR33),INDIRECT(AS33),\"\"),\"\")","v":{"$error":"#N/A"}},{"$f":"IF(COLUMN()>=INDIRECT(AQ33),IF(COLUMN()<=INDIRECT(AR33),INDIRECT(AS33),\"\"),\"\")","v":{"$error":"#N/A"}},{"$f":"IF(COLUMN()>=INDIRECT(AQ33),IF(COLUMN()<=INDIRECT(AR33),INDIRECT(AS33),\"\"),\"\")","v":{"$error":"#N/A"}},{"$f":"IF(COLUMN()>=INDIRECT(AQ33),IF(COLUMN()<=INDIRECT(AR33),INDIRECT(AS33),\"\"),\"\")","v":{"$error":"#N/A"}},{"$f":"IF(COLUMN()>=INDIRECT(AQ33),IF(COLUMN()<=INDIRECT(AR33),INDIRECT(AS33),\"\"),\"\")","v":{"$error":"#N/A"}},{"$f":"IF(COLUMN()>=INDIRECT(AQ33),IF(COLUMN()<=INDIRECT(AR33),INDIRECT(AS33),\"\"),\"\")","v":{"$error":"#N/A"}},{"$f":"IF(COLUMN()>=INDIRECT(AQ33),IF(COLUMN()<=INDIRECT(AR33),INDIRECT(AS33),\"\"),\"\")","v":{"$error":"#N/A"}},{"$f":"IF(COLUMN()>=INDIRECT(AQ33),IF(COLUMN()<=INDIRECT(AR33),INDIRECT(AS33),\"\"),\"\")","v":{"$error":"#N/A"}},{"$f":"IF(COLUMN()>=INDIRECT(AQ33),IF(COLUMN()<=INDIRECT(AR33),INDIRECT(AS33),\"\"),\"\")","v":{"$error":"#N/A"}},{"$f":"IF(COLUMN()>=INDIRECT(AQ33),IF(COLUMN()<=INDIRECT(AR33),INDIRECT(AS33),\"\"),\"\")","v":{"$error":"#N/A"}},{"$f":"IF(COLUMN()>=INDIRECT(AQ33),IF(COLUMN()<=INDIRECT(AR33),INDIRECT(AS33),\"\"),\"\")","v":{"$error":"#N/A"}},{"$f":"IF(COLUMN()>=INDIRECT(AQ33),IF(COLUMN()<=INDIRECT(AR33),INDIRECT(AS33),\"\"),\"\")","v":{"$error":"#N/A"}},{"$f":"IF(COLUMN()>=INDIRECT(AQ33),IF(COLUMN()<=INDIRECT(AR33),INDIRECT(AS33),\"\"),\"\")","v":{"$error":"#N/A"}},{"$f":"IF(COLUMN()>=INDIRECT(AQ33),IF(COLUMN()<=INDIRECT(AR33),INDIRECT(AS33),\"\"),\"\")","v":{"$error":"#N/A"}},{"$f":"IF(COLUMN()>=INDIRECT(AQ33),IF(COLUMN()<=INDIRECT(AR33),INDIRECT(AS33),\"\"),\"\")","v":{"$error":"#N/A"}},{"$f":"IF(COLUMN()>=INDIRECT(AQ33),IF(COLUMN()<=INDIRECT(AR33),INDIRECT(AS33),\"\"),\"\")","v":{"$error":"#N/A"}},{"$f":"IF(COLUMN()>=INDIRECT(AQ33),IF(COLUMN()<=INDIRECT(AR33),INDIRECT(AS33),\"\"),\"\")","v":{"$error":"#N/A"}},{"$f":"IF(COLUMN()>=INDIRECT(AQ33),IF(COLUMN()<=INDIRECT(AR33),INDIRECT(AS33),\"\"),\"\")","v":{"$error":"#N/A"}},{"$f":"IF(COLUMN()>=INDIRECT(AQ33),IF(COLUMN()<=INDIRECT(AR33),INDIRECT(AS33),\"\"),\"\")","v":{"$error":"#N/A"}},{"$f":"IF(COLUMN()>=INDIRECT(AQ33),IF(COLUMN()<=INDIRECT(AR33),INDIRECT(AS33),\"\"),\"\")","v":{"$error":"#N/A"}},{"$f":"IF(COLUMN()>=INDIRECT(AQ33),IF(COLUMN()<=INDIRECT(AR33),INDIRECT(AS33),\"\"),\"\")","v":{"$error":"#N/A"}},{"$f":"IF(COLUMN()>=INDIRECT(AQ33),IF(COLUMN()<=INDIRECT(AR33),INDIRECT(AS33),\"\"),\"\")","v":{"$error":"#N/A"}},{"$f":"IF(COLUMN()>=INDIRECT(AQ33),IF(COLUMN()<=INDIRECT(AR33),INDIRECT(AS33),\"\"),\"\")","v":{"$error":"#N/A"}},null,{"$f":"CONCATENATE(\"'\",SUBSTITUTE(SUBSTITUTE(SUBSTITUTE(MID(CELL(\"direccion\",'ETAPA III.a'!M$1),FIND(\"]\",CELL(\"direccion\",'ETAPA III.a'!M$1))+1,LEN(CELL(\"direccion\",'ETAPA III.a'!M$1))),\"$\",\"\"),1,MATCH($A30,'ETAPA III.a'!$K:$K,0)),\"!\",\"!$\"))","v":"'ETAPA III.a'!$M148"},{"$f":"CONCATENATE(\"'\",SUBSTITUTE(SUBSTITUTE(SUBSTITUTE(MID(CELL(\"direccion\",'ETAPA III.a'!N$1),FIND(\"]\",CELL(\"direccion\",'ETAPA III.a'!N$1))+1,LEN(CELL(\"direccion\",'ETAPA III.a'!N$1))),\"$\",\"\"),1,MATCH($A30,'ETAPA III.a'!$K:$K,0)),\"!\",\"!$\"))","v":"'ETAPA III.a'!$N148"},{"$f":"CONCATENATE(\"'\",SUBSTITUTE(SUBSTITUTE(SUBSTITUTE(MID(CELL(\"direccion\",'ETAPA III.a'!L$1),FIND(\"]\",CELL(\"direccion\",'ETAPA III.a'!L$1))+1,LEN(CELL(\"direccion\",'ETAPA III.a'!L$1))),\"$\",\"\"),1,MATCH($A30,'ETAPA III.a'!$K:$K,0)),\"!\",\"!$\"))","v":"'ETAPA III.a'!$L148"}]
[21,{"$f":"IF(COLUMN()>=INDIRECT(AQ34),IF(COLUMN()<=INDIRECT(AR34),INDIRECT(AS34),\"\"),\"\")","v":{"$error":"#N/A"}},{"$f":"IF(COLUMN()>=INDIRECT(AQ34),IF(COLUMN()<=INDIRECT(AR34),INDIRECT(AS34),\"\"),\"\")","v":{"$error":"#N/A"}},{"$f":"IF(COLUMN()>=INDIRECT(AQ34),IF(COLUMN()<=INDIRECT(AR34),INDIRECT(AS34),\"\"),\"\")","v":{"$error":"#N/A"}},{"$f":"IF(COLUMN()>=INDIRECT(AQ34),IF(COLUMN()<=INDIRECT(AR34),INDIRECT(AS34),\"\"),\"\")","v":{"$error":"#N/A"}},{"$f":"IF(COLUMN()>=INDIRECT(AQ34),IF(COLUMN()<=INDIRECT(AR34),INDIRECT(AS34),\"\"),\"\")","v":{"$error":"#N/A"}},{"$f":"IF(COLUMN()>=INDIRECT(AQ34),IF(COLUMN()<=INDIRECT(AR34),INDIRECT(AS34),\"\"),\"\")","v":{"$error":"#N/A"}},{"$f":"IF(COLUMN()>=INDIRECT(AQ34),IF(COLUMN()<=INDIRECT(AR34),INDIRECT(AS34),\"\"),\"\")","v":{"$error":"#N/A"}},{"$f":"IF(COLUMN()>=INDIRECT(AQ34),IF(COLUMN()<=INDIRECT(AR34),INDIRECT(AS34),\"\"),\"\")","v":{"$error":"#N/A"}},{"$f":"IF(COLUMN()>=INDIRECT(AQ34),IF(COLUMN()<=INDIRECT(AR34),INDIRECT(AS34),\"\"),\"\")","v":{"$error":"#N/A"}},{"$f":"IF(COLUMN()>=INDIRECT(AQ34),IF(COLUMN()<=INDIRECT(AR34),INDIRECT(AS34),\"\"),\"\")","v":{"$error":"#N/A"}},{"$f":"IF(COLUMN()>=INDIRECT(AQ34),IF(COLUMN()<=INDIRECT(AR34),INDIRECT(AS34),\"\"),\"\")","v":{"$error":"#N/A"}},{"$f":"IF(COLUMN()>=INDIRECT(AQ34),IF(COLUMN()<=INDIRECT(AR34),INDIRECT(AS34),\"\"),\"\")","v":{"$error":"#N/A"}},{"$f":"IF(COLUMN()>=INDIRECT(AQ34),IF(COLUMN()<=INDIRECT(AR34),INDIRECT(AS34),\"\"),\"\")","v":{"$error":"#N/A"}},{"$f":"IF(COLUMN()>=INDIRECT(AQ34),IF(COLUMN()<=INDIRECT(AR34),INDIRECT(AS34),\"\"),\"\")","v":{"$error":"#N/A"}},{"$f":"IF(COLUMN()>=INDIRECT(AQ34),IF(COLUMN()<=INDIRECT(AR34),INDIRECT(AS34),\"\"),\"\")","v":{"$error":"#N/A"}},{"$f":"IF(COLUMN()>=INDIRECT(AQ34),IF(COLUMN()<=INDIRECT(AR34),INDIRECT(AS34),\"\"),\"\")","v":{"$error":"#N/A"}},{"$f":"IF(COLUMN()>=INDIRECT(AQ34),IF(COLUMN()<=INDIRECT(AR34),INDIRECT(AS34),\"\"),\"\")","v":{"$error":"#N/A"}},{"$f":"IF(COLUMN()>=INDIRECT(AQ34),IF(COLUMN()<=INDIRECT(AR34),INDIRECT(AS34),\"\"),\"\")","v":{"$error":"#N/A"}},{"$f":"IF(COLUMN()>=INDIRECT(AQ34),IF(COLUMN()<=INDIRECT(AR34),INDIRECT(AS34),\"\"),\"\")","v":{"$error":"#N/A"}},{"$f":"IF(COLUMN()>=INDIRECT(AQ34),IF(COLUMN()<=INDIRECT(AR34),INDIRECT(AS34),\"\"),\"\")","v":{"$error":"#N/A"}},{"$f":"IF(COLUMN()>=INDIRECT(AQ34),IF(COLUMN()<=INDIRECT(AR34),INDIRECT(AS34),\"\"),\"\")","v":{"$error":"#N/A"}},{"$f":"IF(COLUMN()>=INDIRECT(AQ34),IF(COLUMN()<=INDIRECT(AR34),INDIRECT(AS34),\"\"),\"\")","v":{"$error":"#N/A"}},{"$f":"IF(COLUMN()>=INDIRECT(AQ34),IF(COLUMN()<=INDIRECT(AR34),INDIRECT(AS34),\"\"),\"\")","v":{"$error":"#N/A"}},{"$f":"IF(COLUMN()>=INDIRECT(AQ34),IF(COLUMN()<=INDIRECT(AR34),INDIRECT(AS34),\"\"),\"\")","v":{"$error":"#N/A"}},{"$f":"IF(COLUMN()>=INDIRECT(AQ34),IF(COLUMN()<=INDIRECT(AR34),INDIRECT(AS34),\"\"),\"\")","v":{"$error":"#N/A"}},{"$f":"IF(COLUMN()>=INDIRECT(AQ34),IF(COLUMN()<=INDIRECT(AR34),INDIRECT(AS34),\"\"),\"\")","v":{"$error":"#N/A"}},{"$f":"IF(COLUMN()>=INDIRECT(AQ34),IF(COLUMN()<=INDIRECT(AR34),INDIRECT(AS34),\"\"),\"\")","v":{"$error":"#N/A"}},{"$f":"IF(COLUMN()>=INDIRECT(AQ34),IF(COLUMN()<=INDIRECT(AR34),INDIRECT(AS34),\"\"),\"\")","v":{"$error":"#N/A"}},{"$f":"IF(COLUMN()>=INDIRECT(AQ34),IF(COLUMN()<=INDIRECT(AR34),INDIRECT(AS34),\"\"),\"\")","v":{"$error":"#N/A"}},{"$f":"IF(COLUMN()>=INDIRECT(AQ34),IF(COLUMN()<=INDIRECT(AR34),INDIRECT(AS34),\"\"),\"\")","v":{"$error":"#N/A"}},{"$f":"IF(COLUMN()>=INDIRECT(AQ34),IF(COLUMN()<=INDIRECT(AR34),INDIRECT(AS34),\"\"),\"\")","v":{"$error":"#N/A"}},{"$f":"IF(COLUMN()>=INDIRECT(AQ34),IF(COLUMN()<=INDIRECT(AR34),INDIRECT(AS34),\"\"),\"\")","v":{"$error":"#N/A"}},{"$f":"IF(COLUMN()>=INDIRECT(AQ34),IF(COLUMN()<=INDIRECT(AR34),INDIRECT(AS34),\"\"),\"\")","v":{"$error":"#N/A"}},{"$f":"IF(COLUMN()>=INDIRECT(AQ34),IF(COLUMN()<=INDIRECT(AR34),INDIRECT(AS34),\"\"),\"\")","v":{"$error":"#N/A"}},{"$f":"IF(COLUMN()>=INDIRECT(AQ34),IF(COLUMN()<=INDIRECT(AR34),INDIRECT(AS34),\"\"),\"\")","v":{"$error":"#N/A"}},{"$f":"IF(COLUMN()>=INDIRECT(AQ34),IF(COLUMN()<=INDIRECT(AR34),INDIRECT(AS34),\"\"),\"\")","v":{"$error":"#N/A"}},{"$f":"IF(COLUMN()>=INDIRECT(AQ34),IF(COLUMN()<=INDIRECT(AR34),INDIRECT(AS34),\"\"),\"\")","v":{"$error":"#N/A"}},{"$f":"IF(COLUMN()>=INDIRECT(AQ34),IF(COLUMN()<=INDIRECT(AR34),INDIRECT(AS34),\"\"),\"\")","v":{"$error":"#N/A"}},{"$f":"IF(COLUMN()>=INDIRECT(AQ34),IF(COLUMN()<=INDIRECT(AR34),INDIRECT(AS34),\"\"),\"\")","v":{"$error":"#N/A"}},{"$f":"IF(COLUMN()>=INDIRECT(AQ34),IF(COLUMN()<=INDIRECT(AR34),INDIRECT(AS34),\"\"),\"\")","v":{"$error":"#N/A"}},null,{"$f":"CONCATENATE(\"'\",SUBSTITUTE(SUBSTITUTE(SUBSTITUTE(MID(CELL(\"direccion\",'ETAPA III.a'!M$1),FIND(\"]\",CELL(\"direccion\",'ETAPA III.a'!M$1))+1,LEN(CELL(\"direccion\",'ETAPA III.a'!M$1))),\"$\",\"\"),1,MATCH($A31,'ETAPA III.a'!$K:$K,0)),\"!\",\"!$\"))","v":"'ETAPA III.a'!$M155"},{"$f":"CONCATENATE(\"'\",SUBSTITUTE(SUBSTITUTE(SUBSTITUTE(MID(CELL(\"direccion\",'ETAPA III.a'!N$1),FIND(\"]\",CELL(\"direccion\",'ETAPA III.a'!N$1))+1,LEN(CELL(\"direccion\",'ETAPA III.a'!N$1))),\"$\",\"\"),1,MATCH($A31,'ETAPA III.a'!$K:$K,0)),\"!\",\"!$\"))","v":"'ETAPA III.a'!$N155"},{"$f":"CONCATENATE(\"'\",SUBSTITUTE(SUBSTITUTE(SUBSTITUTE(MID(CELL(\"direccion\",'ETAPA III.a'!L$1),FIND(\"]\",CELL(\"direccion\",'ETAPA III.a'!L$1))+1,LEN(CELL(\"direccion\",'ETAPA III.a'!L$1))),\"$\",\"\"),1,MATCH($A31,'ETAPA III.a'!$K:$K,0)),\"!\",\"!$\"))","v":"'ETAPA III.a'!$L155"}]
[22,{"$f":"IF(COLUMN()>=INDIRECT(AQ35),IF(COLUMN()<=INDIRECT(AR35),INDIRECT(AS35),\"\"),\"\")","v":{"$error":"#N/A"}},{"$f":"IF(COLUMN()>=INDIRECT(AQ35),IF(COLUMN()<=INDIRECT(AR35),INDIRECT(AS35),\"\"),\"\")","v":{"$error":"#N/A"}},{"$f":"IF(COLUMN()>=INDIRECT(AQ35),IF(COLUMN()<=INDIRECT(AR35),INDIRECT(AS35),\"\"),\"\")","v":{"$error":"#N/A"}},{"$f":"IF(COLUMN()>=INDIRECT(AQ35),IF(COLUMN()<=INDIRECT(AR35),INDIRECT(AS35),\"\"),\"\")","v":{"$error":"#N/A"}},{"$f":"IF(COLUMN()>=INDIRECT(AQ35),IF(COLUMN()<=INDIRECT(AR35),INDIRECT(AS35),\"\"),\"\")","v":{"$error":"#N/A"}},{"$f":"IF(COLUMN()>=INDIRECT(AQ35),IF(COLUMN()<=INDIRECT(AR35),INDIRECT(AS35),\"\"),\"\")","v":{"$error":"#N/A"}},{"$f":"IF(COLUMN()>=INDIRECT(AQ35),IF(COLUMN()<=INDIRECT(AR35),INDIRECT(AS35),\"\"),\"\")","v":{"$error":"#N/A"}},{"$f":"IF(COLUMN()>=INDIRECT(AQ35),IF(COLUMN()<=INDIRECT(AR35),INDIRECT(AS35),\"\"),\"\")","v":{"$error":"#N/A"}},{"$f":"IF(COLUMN()>=INDIRECT(AQ35),IF(COLUMN()<=INDIRECT(AR35),INDIRECT(AS35),\"\"),\"\")","v":{"$error":"#N/A"}},{"$f":"IF(COLUMN()>=INDIRECT(AQ35),IF(COLUMN()<=INDIRECT(AR35),INDIRECT(AS35),\"\"),\"\")","v":{"$error":"#N/A"}},{"$f":"IF(COLUMN()>=INDIRECT(AQ35),IF(COLUMN()<=INDIRECT(AR35),INDIRECT(AS35),\"\"),\"\")","v":{"$error":"#N/A"}},{"$f":"IF(COLUMN()>=INDIRECT(AQ35),IF(COLUMN()<=INDIRECT(AR35),INDIRECT(AS35),\"\"),\"\")","v":{"$error":"#N/A"}},{"$f":"IF(COLUMN()>=INDIRECT(AQ35),IF(COLUMN()<=INDIRECT(AR35),INDIRECT(AS35),\"\"),\"\")","v":{"$error":"#N/A"}},{"$f":"IF(COLUMN()>=INDIRECT(AQ35),IF(COLUMN()<=INDIRECT(AR35),INDIRECT(AS35),\"\"),\"\")","v":{"$error":"#N/A"}},{"$f":"IF(COLUMN()>=INDIRECT(AQ35),IF(COLUMN()<=INDIRECT(AR35),INDIRECT(AS35),\"\"),\"\")","v":{"$error":"#N/A"}},{"$f":"IF(COLUMN()>=INDIRECT(AQ35),IF(COLUMN()<=INDIRECT(AR35),INDIRECT(AS35),\"\"),\"\")","v":{"$error":"#N/A"}},{"$f":"IF(COLUMN()>=INDIRECT(AQ35),IF(COLUMN()<=INDIRECT(AR35),INDIRECT(AS35),\"\"),\"\")","v":{"$error":"#N/A"}},{"$f":"IF(COLUMN()>=INDIRECT(AQ35),IF(COLUMN()<=INDIRECT(AR35),INDIRECT(AS35),\"\"),\"\")","v":{"$error":"#N/A"}},{"$f":"IF(COLUMN()>=INDIRECT(AQ35),IF(COLUMN()<=INDIRECT(AR35),INDIRECT(AS35),\"\"),\"\")","v":{"$error":"#N/A"}},{"$f":"IF(COLUMN()>=INDIRECT(AQ35),IF(COLUMN()<=INDIRECT(AR35),INDIRECT(AS35),\"\"),\"\")","v":{"$error":"#N/A"}},{"$f":"IF(COLUMN()>=INDIRECT(AQ35),IF(COLUMN()<=INDIRECT(AR35),INDIRECT(AS35),\"\"),\"\")","v":{"$error":"#N/A"}},{"$f":"IF(COLUMN()>=INDIRECT(AQ35),IF(COLUMN()<=INDIRECT(AR35),INDIRECT(AS35),\"\"),\"\")","v":{"$error":"#N/A"}},{"$f":"IF(COLUMN()>=INDIRECT(AQ35),IF(COLUMN()<=INDIRECT(AR35),INDIRECT(AS35),\"\"),\"\")","v":{"$error":"#N/A"}},{"$f":"IF(COLUMN()>=INDIRECT(AQ35),IF(COLUMN()<=INDIRECT(AR35),INDIRECT(AS35),\"\"),\"\")","v":{"$error":"#N/A"}},{"$f":"IF(COLUMN()>=INDIRECT(AQ35),IF(COLUMN()<=INDIRECT(AR35),INDIRECT(AS35),\"\"),\"\")","v":{"$error":"#N/A"}},{"$f":"IF(COLUMN()>=INDIRECT(AQ35),IF(COLUMN()<=INDIRECT(AR35),INDIRECT(AS35),\"\"),\"\")","v":{"$error":"#N/A"}},{"$f":"IF(COLUMN()>=INDIRECT(AQ35),IF(COLUMN()<=INDIRECT(AR35),INDIRECT(AS35),\"\"),\"\")","v":{"$error":"#N/A"}},{"$f":"IF(COLUMN()>=INDIRECT(AQ35),IF(COLUMN()<=INDIRECT(AR35),INDIRECT(AS35),\"\"),\"\")","v":{"$error":"#N/A"}},{"$f":"IF(COLUMN()>=INDIRECT(AQ35),IF(COLUMN()<=INDIRECT(AR35),INDIRECT(AS35),\"\"),\"\")","v":{"$error":"#N/A"}},{"$f":"IF(COLUMN()>=INDIRECT(AQ35),IF(COLUMN()<=INDIRECT(AR35),INDIRECT(AS35),\"\"),\"\")","v":{"$error":"#N/A"}},{"$f":"IF(COLUMN()>=INDIRECT(AQ35),IF(COLUMN()<=INDIRECT(AR35),INDIRECT(AS35),\"\"),\"\")","v":{"$error":"#N/A"}},{"$f":"IF(COLUMN()>=INDIRECT(AQ35),IF(COLUMN()<=INDIRECT(AR35),INDIRECT(AS35),\"\"),\"\")","v":{"$error":"#N/A"}},{"$f":"IF(COLUMN()>=INDIRECT(AQ35),IF(COLUMN()<=INDIRECT(AR35),INDIRECT(AS35),\"\"),\"\")","v":{"$error":"#N/A"}},{"$f":"IF(COLUMN()>=INDIRECT(AQ35),IF(COLUMN()<=INDIRECT(AR35),INDIRECT(AS35),\"\"),\"\")","v":{"$error":"#N/A"}},{"$f":"IF(COLUMN()>=INDIRECT(AQ35),IF(COLUMN()<=INDIRECT(AR35),INDIRECT(AS35),\"\"),\"\")","v":{"$error":"#N/A"}},{"$f":"IF(COLUMN()>=INDIRECT(AQ35),IF(COLUMN()<=INDIRECT(AR35),INDIRECT(AS35),\"\"),\"\")","v":{"$error":"#N/A"}},{"$f":"IF(COLUMN()>=INDIRECT(AQ35),IF(COLUMN()<=INDIRECT(AR35),INDIRECT(AS35),\"\"),\"\")","v":{"$error":"#N/A"}},{"$f":"IF(COLUMN()>=INDIRECT(AQ35),IF(COLUMN()<=INDIRECT(AR35),INDIRECT(AS35),\"\"),\"\")","v":{"$error":"#N/A"}},{"$f":"IF(COLUMN()>=INDIRECT(AQ35),IF(COLUMN()<=INDIRECT(AR35),INDIRECT(AS35),\"\"),\"\")","v":{"$error":"#N/A"}},{"$f":"IF(COLUMN()>=INDIRECT(AQ35),IF(COLUMN()<=INDIRECT(AR35),INDIRECT(AS35),\"\"),\"\")","v":{"$error":"#N/A"}},null,{"$f":"CONCATENATE(\"'\",SUBSTITUTE(SUBSTITUTE(SUBSTITUTE(MID(CELL(\"direccion\",'ETAPA III.a'!M$1),FIND(\"]\",CELL(\"direccion\",'ETAPA III.a'!M$1))+1,LEN(CELL(\"direccion\",'ETAPA III.a'!M$1))),\"$\",\"\"),1,MATCH($A32,'ETAPA III.a'!$K:$K,0)),\"!\",\"!$\"))","v":"'ETAPA III.a'!$M162"},{"$f":"CONCATENATE(\"'\",SUBSTITUTE(SUBSTITUTE(SUBSTITUTE(MID(CELL(\"direccion\",'ETAPA III.a'!N$1),FIND(\"]\",CELL(\"direccion\",'ETAPA III.a'!N$1))+1,LEN(CELL(\"direccion\",'ETAPA III.a'!N$1))),\"$\",\"\"),1,MATCH($A32,'ETAPA III.a'!$K:$K,0)),\"!\",\"!$\"))","v":"'ETAPA III.a'!$N162"},{"$f":"CONCATENATE(\"'\",SUBSTITUTE(SUBSTITUTE(SUBSTITUTE(MID(CELL(\"direccion\",'ETAPA III.a'!L$1),FIND(\"]\",CELL(\"direccion\",'ETAPA III.a'!L$1))+1,LEN(CELL(\"direccion\",'ETAPA III.a'!L$1))),\"$\",\"\"),1,MATCH($A32,'ETAPA III.a'!$K:$K,0)),\"!\",\"!$\"))","v":"'ETAPA III.a'!$L162"}]
[23,{"$f":"IF(COLUMN()>=INDIRECT(AQ36),IF(COLUMN()<=INDIRECT(AR36),INDIRECT(AS36),\"\"),\"\")","v":{"$error":"#N/A"}},{"$f":"IF(COLUMN()>=INDIRECT(AQ36),IF(COLUMN()<=INDIRECT(AR36),INDIRECT(AS36),\"\"),\"\")","v":{"$error":"#N/A"}},{"$f":"IF(COLUMN()>=INDIRECT(AQ36),IF(COLUMN()<=INDIRECT(AR36),INDIRECT(AS36),\"\"),\"\")","v":{"$error":"#N/A"}},{"$f":"IF(COLUMN()>=INDIRECT(AQ36),IF(COLUMN()<=INDIRECT(AR36),INDIRECT(AS36),\"\"),\"\")","v":{"$error":"#N/A"}},{"$f":"IF(COLUMN()>=INDIRECT(AQ36),IF(COLUMN()<=INDIRECT(AR36),INDIRECT(AS36),\"\"),\"\")","v":{"$error":"#N/A"}},{"$f":"IF(COLUMN()>=INDIRECT(AQ36),IF(COLUMN()<=INDIRECT(AR36),INDIRECT(AS36),\"\"),\"\")","v":{"$error":"#N/A"}},{"$f":"IF(COLUMN()>=INDIRECT(AQ36),IF(COLUMN()<=INDIRECT(AR36),INDIRECT(AS36),\"\"),\"\")","v":{"$error":"#N/A"}},{"$f":"IF(COLUMN()>=INDIRECT(AQ36),IF(COLUMN()<=INDIRECT(AR36),INDIRECT(AS36),\"\"),\"\")","v":{"$error":"#N/A"}},{"$f":"IF(COLUMN()>=INDIRECT(AQ36),IF(COLUMN()<=INDIRECT(AR36),INDIRECT(AS36),\"\"),\"\")","v":{"$error":"#N/A"}},{"$f":"IF(COLUMN()>=INDIRECT(AQ36),IF(COLUMN()<=INDIRECT(AR36),INDIRECT(AS36),\"\"),\"\")","v":{"$error":"#N/A"}},{"$f":"IF(COLUMN()>=INDIRECT(AQ36),IF(COLUMN()<=INDIRECT(AR36),INDIRECT(AS36),\"\"),\"\")","v":{"$error":"#N/A"}},{"$f":"IF(COLUMN()>=INDIRECT(AQ36),IF(COLUMN()<=INDIRECT(AR36),INDIRECT(AS36),\"\"),\"\")","v":{"$error":"#N/A"}},{"$f":"IF(COLUMN()>=INDIRECT(AQ36),IF(COLUMN()<=INDIRECT(AR36),INDIRECT(AS36),\"\"),\"\")","v":{"$error":"#N/A"}},{"$f":"IF(COLUMN()>=INDIRECT(AQ36),IF(COLUMN()<=INDIRECT(AR36),INDIRECT(AS36),\"\"),\"\")","v":{"$error":"#N/A"}},{"$f":"IF(COLUMN()>=INDIRECT(AQ36),IF(COLUMN()<=INDIRECT(AR36),INDIRECT(AS36),\"\"),\"\")","v":{"$error":"#N/A"}},{"$f":"IF(COLUMN()>=INDIRECT(AQ36),IF(COLUMN()<=INDIRECT(AR36),INDIRECT(AS36),\"\"),\"\")","v":{"$error":"#N/A"}},{"$f":"IF(COLUMN()>=INDIRECT(AQ36),IF(COLUMN()<=INDIRECT(AR36),INDIRECT(AS36),\"\"),\"\")","v":{"$error":"#N/A"}},{"$f":"IF(COLUMN()>=INDIRECT(AQ36),IF(COLUMN()<=INDIRECT(AR36),INDIRECT(AS36),\"\"),\"\")","v":{"$error":"#N/A"}},{"$f":"IF(COLUMN()>=INDIRECT(AQ36),IF(COLUMN()<=INDIRECT(AR36),INDIRECT(AS36),\"\"),\"\")","v":{"$error":"#N/A"}},{"$f":"IF(COLUMN()>=INDIRECT(AQ36),IF(COLUMN()<=INDIRECT(AR36),INDIRECT(AS36),\"\"),\"\")","v":{"$error":"#N/A"}},{"$f":"IF(COLUMN()>=INDIRECT(AQ36),IF(COLUMN()<=INDIRECT(AR36),INDIRECT(AS36),\"\"),\"\")","v":{"$error":"#N/A"}},{"$f":"IF(COLUMN()>=INDIRECT(AQ36),IF(COLUMN()<=INDIRECT(AR36),INDIRECT(AS36),\"\"),\"\")","v":{"$error":"#N/A"}},{"$f":"IF(COLUMN()>=INDIRECT(AQ36),IF(COLUMN()<=INDIRECT(AR36),INDIRECT(AS36),\"\"),\"\")","v":{"$error":"#N/A"}},{"$f":"IF(COLUMN()>=INDIRECT(AQ36),IF(COLUMN()<=INDIRECT(AR36),INDIRECT(AS36),\"\"),\"\")","v":{"$error":"#N/A"}},{"$f":"IF(COLUMN()>=INDIRECT(AQ36),IF(COLUMN()<=INDIRECT(AR36),INDIRECT(AS36),\"\"),\"\")","v":{"$error":"#N/A"}},{"$f":"IF(COLUMN()>=INDIRECT(AQ36),IF(COLUMN()<=INDIRECT(AR36),INDIRECT(AS36),\"\"),\"\")","v":{"$error":"#N/A"}},{"$f":"IF(COLUMN()>=INDIRECT(AQ36),IF(COLUMN()<=INDIRECT(AR36),INDIRECT(AS36),\"\"),\"\")","v":{"$error":"#N/A"}},{"$f":"IF(COLUMN()>=INDIRECT(AQ36),IF(COLUMN()<=INDIRECT(AR36),INDIRECT(AS36),\"\"),\"\")","v":{"$error":"#N/A"}},{"$f":"IF(COLUMN()>=INDIRECT(AQ36),IF(COLUMN()<=INDIRECT(AR36),INDIRECT(AS36),\"\"),\"\")","v":{"$error":"#N/A"}},{"$f":"IF(COLUMN()>=INDIRECT(AQ36),IF(COLUMN()<=INDIRECT(AR36),INDIRECT(AS36),\"\"),\"\")","v":{"$error":"#N/A"}},{"$f":"IF(COLUMN()>=INDIRECT(AQ36),IF(COLUMN()<=INDIRECT(AR36),INDIRECT(AS36),\"\"),\"\")","v":{"$error":"#N/A"}},{"$f":"IF(COLUMN()>=INDIRECT(AQ36),IF(COLUMN()<=INDIRECT(AR36),INDIRECT(AS36),\"\"),\"\")","v":{"$error":"#N/A"}},{"$f":"IF(COLUMN()>=INDIRECT(AQ36),IF(COLUMN()<=INDIRECT(AR36),INDIRECT(AS36),\"\"),\"\")","v":{"$error":"#N/A"}},{"$f":"IF(COLUMN()>=INDIRECT(AQ36),IF(COLUMN()<=INDIRECT(AR36),INDIRECT(AS36),\"\"),\"\")","v":{"$error":"#N/A"}},{"$f":"IF(COLUMN()>=INDIRECT(AQ36),IF(COLUMN()<=INDIRECT(AR36),INDIRECT(AS36),\"\"),\"\")","v":{"$error":"#N/A"}},{"$f":"IF(COLUMN()>=INDIRECT(AQ36),IF(COLUMN()<=INDIRECT(AR36),INDIRECT(AS36),\"\"),\"\")","v":{"$error":"#N/A"}},{"$f":"IF(COLUMN()>=INDIRECT(AQ36),IF(COLUMN()<=INDIRECT(AR36),INDIRECT(AS36),\"\"),\"\")","v":{"$error":"#N/A"}},{"$f":"IF(COLUMN()>=INDIRECT(AQ36),IF(COLUMN()<=INDIRECT(AR36),INDIRECT(AS36),\"\"),\"\")","v":{"$error":"#N/A"}},{"$f":"IF(COLUMN()>=INDIRECT(AQ36),IF(COLUMN()<=INDIRECT(AR36),INDIRECT(AS36),\"\"),\"\")","v":{"$error":"#N/A"}},{"$f":"IF(COLUMN()>=INDIRECT(AQ36),IF(COLUMN()<=INDIRECT(AR36),INDIRECT(AS36),\"\"),\"\")","v":{"$error":"#N/A"}},null,{"$f":"CONCATENATE(\"'\",SUBSTITUTE(SUBSTITUTE(SUBSTITUTE(MID(CELL(\"direccion\",'ETAPA III.a'!M$1),FIND(\"]\",CELL(\"direccion\",'ETAPA III.a'!M$1))+1,LEN(CELL(\"direccion\",'ETAPA III.a'!M$1))),\"$\",\"\"),1,MATCH($A33,'ETAPA III.a'!$K:$K,0)),\"!\",\"!$\"))","v":"'ETAPA III.a'!$M169"},{"$f":"CONCATENATE(\"'\",SUBSTITUTE(SUBSTITUTE(SUBSTITUTE(MID(CELL(\"direccion\",'ETAPA III.a'!N$1),FIND(\"]\",CELL(\"direccion\",'ETAPA III.a'!N$1))+1,LEN(CELL(\"direccion\",'ETAPA III.a'!N$1))),\"$\",\"\"),1,MATCH($A33,'ETAPA III.a'!$K:$K,0)),\"!\",\"!$\"))","v":"'ETAPA III.a'!$N169"},{"$f":"CONCATENATE(\"'\",SUBSTITUTE(SUBSTITUTE(SUBSTITUTE(MID(CELL(\"direccion\",'ETAPA III.a'!L$1),FIND(\"]\",CELL(\"direccion\",'ETAPA III.a'!L$1))+1,LEN(CELL(\"direccion\",'ETAPA III.a'!L$1))),\"$\",\"\"),1,MATCH($A33,'ETAPA III.a'!$K:$K,0)),\"!\",\"!$\"))","v":"'ETAPA III.a'!$L169"}]
[24,{"$f":"IF(COLUMN()>=INDIRECT(AQ37),IF(COLUMN()<=INDIRECT(AR37),INDIRECT(AS37),\"\"),\"\")","v":{"$error":"#N/A"}},{"$f":"IF(COLUMN()>=INDIRECT(AQ37),IF(COLUMN()<=INDIRECT(AR37),INDIRECT(AS37),\"\"),\"\")","v":{"$error":"#N/A"}},{"$f":"IF(COLUMN()>=INDIRECT(AQ37),IF(COLUMN()<=INDIRECT(AR37),INDIRECT(AS37),\"\"),\"\")","v":{"$error":"#N/A"}},{"$f":"IF(COLUMN()>=INDIRECT(AQ37),IF(COLUMN()<=INDIRECT(AR37),INDIRECT(AS37),\"\"),\"\")","v":{"$error":"#N/A"}},{"$f":"IF(COLUMN()>=INDIRECT(AQ37),IF(COLUMN()<=INDIRECT(AR37),INDIRECT(AS37),\"\"),\"\")","v":{"$error":"#N/A"}},{"$f":"IF(COLUMN()>=INDIRECT(AQ37),IF(COLUMN()<=INDIRECT(AR37),INDIRECT(AS37),\"\"),\"\")","v":{"$error":"#N/A"}},{"$f":"IF(COLUMN()>=INDIRECT(AQ37),IF(COLUMN()<=INDIRECT(AR37),INDIRECT(AS37),\"\"),\"\")","v":{"$error":"#N/A"}},{"$f":"IF(COLUMN()>=INDIRECT(AQ37),IF(COLUMN()<=INDIRECT(AR37),INDIRECT(AS37),\"\"),\"\")","v":{"$error":"#N/A"}},{"$f":"IF(COLUMN()>=INDIRECT(AQ37),IF(COLUMN()<=INDIRECT(AR37),INDIRECT(AS37),\"\"),\"\")","v":{"$error":"#N/A"}},{"$f":"IF(COLUMN()>=INDIRECT(AQ37),IF(COLUMN()<=INDIRECT(AR37),INDIRECT(AS37),\"\"),\"\")","v":{"$error":"#N/A"}},{"$f":"IF(COLUMN()>=INDIRECT(AQ37),IF(COLUMN()<=INDIRECT(AR37),INDIRECT(AS37),\"\"),\"\")","v":{"$error":"#N/A"}},{"$f":"IF(COLUMN()>=INDIRECT(AQ37),IF(COLUMN()<=INDIRECT(AR37),INDIRECT(AS37),\"\"),\"\")","v":{"$error":"#N/A"}},{"$f":"IF(COLUMN()>=INDIRECT(AQ37),IF(COLUMN()<=INDIRECT(AR37),INDIRECT(AS37),\"\"),\"\")","v":{"$error":"#N/A"}},{"$f":"IF(COLUMN()>=INDIRECT(AQ37),IF(COLUMN()<=INDIRECT(AR37),INDIRECT(AS37),\"\"),\"\")","v":{"$error":"#N/A"}},{"$f":"IF(COLUMN()>=INDIRECT(AQ37),IF(COLUMN()<=INDIRECT(AR37),INDIRECT(AS37),\"\"),\"\")","v":{"$error":"#N/A"}},{"$f":"IF(COLUMN()>=INDIRECT(AQ37),IF(COLUMN()<=INDIRECT(AR37),INDIRECT(AS37),\"\"),\"\")","v":{"$error":"#N/A"}},{"$f":"IF(COLUMN()>=INDIRECT(AQ37),IF(COLUMN()<=INDIRECT(AR37),INDIRECT(AS37),\"\"),\"\")","v":{"$error":"#N/A"}},{"$f":"IF(COLUMN()>=INDIRECT(AQ37),IF(COLUMN()<=INDIRECT(AR37),INDIRECT(AS37),\"\"),\"\")","v":{"$error":"#N/A"}},{"$f":"IF(COLUMN()>=INDIRECT(AQ37),IF(COLUMN()<=INDIRECT(AR37),INDIRECT(AS37),\"\"),\"\")","v":{"$error":"#N/A"}},{"$f":"IF(COLUMN()>=INDIRECT(AQ37),IF(COLUMN()<=INDIRECT(AR37),INDIRECT(AS37),\"\"),\"\")","v":{"$error":"#N/A"}},{"$f":"IF(COLUMN()>=INDIRECT(AQ37),IF(COLUMN()<=INDIRECT(AR37),INDIRECT(AS37),\"\"),\"\")","v":{"$error":"#N/A"}},{"$f":"IF(COLUMN()>=INDIRECT(AQ37),IF(COLUMN()<=INDIRECT(AR37),INDIRECT(AS37),\"\"),\"\")","v":{"$error":"#N/A"}},{"$f":"IF(COLUMN()>=INDIRECT(AQ37),IF(COLUMN()<=INDIRECT(AR37),INDIRECT(AS37),\"\"),\"\")","v":{"$error":"#N/A"}},{"$f":"IF(COLUMN()>=INDIRECT(AQ37),IF(COLUMN()<=INDIRECT(AR37),INDIRECT(AS37),\"\"),\"\")","v":{"$error":"#N/A"}},{"$f":"IF(COLUMN()>=INDIRECT(AQ37),IF(COLUMN()<=INDIRECT(AR37),INDIRECT(AS37),\"\"),\"\")","v":{"$error":"#N/A"}},{"$f":"IF(COLUMN()>=INDIRECT(AQ37),IF(COLUMN()<=INDIRECT(AR37),INDIRECT(AS37),\"\"),\"\")","v":{"$error":"#N/A"}},{"$f":"IF(COLUMN()>=INDIRECT(AQ37),IF(COLUMN()<=INDIRECT(AR37),INDIRECT(AS37),\"\"),\"\")","v":{"$error":"#N/A"}},{"$f":"IF(COLUMN()>=INDIRECT(AQ37),IF(COLUMN()<=INDIRECT(AR37),INDIRECT(AS37),\"\"),\"\")","v":{"$error":"#N/A"}},{"$f":"IF(COLUMN()>=INDIRECT(AQ37),IF(COLUMN()<=INDIRECT(AR37),INDIRECT(AS37),\"\"),\"\")","v":{"$error":"#N/A"}},{"$f":"IF(COLUMN()>=INDIRECT(AQ37),IF(COLUMN()<=INDIRECT(AR37),INDIRECT(AS37),\"\"),\"\")","v":{"$error":"#N/A"}},{"$f":"IF(COLUMN()>=INDIRECT(AQ37),IF(COLUMN()<=INDIRECT(AR37),INDIRECT(AS37),\"\"),\"\")","v":{"$error":"#N/A"}},{"$f":"IF(COLUMN()>=INDIRECT(AQ37),IF(COLUMN()<=INDIRECT(AR37),INDIRECT(AS37),\"\"),\"\")","v":{"$error":"#N/A"}},{"$f":"IF(COLUMN()>=INDIRECT(AQ37),IF(COLUMN()<=INDIRECT(AR37),INDIRECT(AS37),\"\"),\"\")","v":{"$error":"#N/A"}},{"$f":"IF(COLUMN()>=INDIRECT(AQ37),IF(COLUMN()<=INDIRECT(AR37),INDIRECT(AS37),\"\"),\"\")","v":{"$error":"#N/A"}},{"$f":"IF(COLUMN()>=INDIRECT(AQ37),IF(COLUMN()<=INDIRECT(AR37),INDIRECT(AS37),\"\"),\"\")","v":{"$error":"#N/A"}},{"$f":"IF(COLUMN()>=INDIRECT(AQ37),IF(COLUMN()<=INDIRECT(AR37),INDIRECT(AS37),\"\"),\"\")","v":{"$error":"#N/A"}},{"$f":"IF(COLUMN()>=INDIRECT(AQ37),IF(COLUMN()<=INDIRECT(AR37),INDIRECT(AS37),\"\"),\"\")","v":{"$error":"#N/A"}},{"$f":"IF(COLUMN()>=INDIRECT(AQ37),IF(COLUMN()<=INDIRECT(AR37),INDIRECT(AS37),\"\"),\"\")","v":{"$error":"#N/A"}},{"$f":"IF(COLUMN()>=INDIRECT(AQ37),IF(COLUMN()<=INDIRECT(AR37),INDIRECT(AS37),\"\"),\"\")","v":{"$error":"#N/A"}},{"$f":"IF(COLUMN()>=INDIRECT(AQ37),IF(COLUMN()<=INDIRECT(AR37),INDIRECT(AS37),\"\"),\"\")","v":{"$error":"#N/A"}},null,{"$f":"CONCATENATE(\"'\",SUBSTITUTE(SUBSTITUTE(SUBSTITUTE(MID(CELL(\"direccion\",'ETAPA III.a'!M$1),FIND(\"]\",CELL(\"direccion\",'ETAPA III.a'!M$1))+1,LEN(CELL(\"direccion\",'ETAPA III.a'!M$1))),\"$\",\"\"),1,MATCH($A34,'ETAPA III.a'!$K:$K,0)),\"!\",\"!$\"))","v":"'ETAPA III.a'!$M176"},{"$f":"CONCATENATE(\"'\",SUBSTITUTE(SUBSTITUTE(SUBSTITUTE(MID(CELL(\"direccion\",'ETAPA III.a'!N$1),FIND(\"]\",CELL(\"direccion\",'ETAPA III.a'!N$1))+1,LEN(CELL(\"direccion\",'ETAPA III.a'!N$1))),\"$\",\"\"),1,MATCH($A34,'ETAPA III.a'!$K:$K,0)),\"!\",\"!$\"))","v":"'ETAPA III.a'!$N176"},{"$f":"CONCATENATE(\"'\",SUBSTITUTE(SUBSTITUTE(SUBSTITUTE(MID(CELL(\"direccion\",'ETAPA III.a'!L$1),FIND(\"]\",CELL(\"direccion\",'ETAPA III.a'!L$1))+1,LEN(CELL(\"direccion\",'ETAPA III.a'!L$1))),\"$\",\"\"),1,MATCH($A34,'ETAPA III.a'!$K:$K,0)),\"!\",\"!$\"))","v":"'ETAPA III.a'!$L176"}]
[25,{"$f":"IF(COLUMN()>=INDIRECT(AQ38),IF(COLUMN()<=INDIRECT(AR38),INDIRECT(AS38),\"\"),\"\")","v":{"$error":"#N/A"}},{"$f":"IF(COLUMN()>=INDIRECT(AQ38),IF(COLUMN()<=INDIRECT(AR38),INDIRECT(AS38),\"\"),\"\")","v":{"$error":"#N/A"}},{"$f":"IF(COLUMN()>=INDIRECT(AQ38),IF(COLUMN()<=INDIRECT(AR38),INDIRECT(AS38),\"\"),\"\")","v":{"$error":"#N/A"}},{"$f":"IF(COLUMN()>=INDIRECT(AQ38),IF(COLUMN()<=INDIRECT(AR38),INDIRECT(AS38),\"\"),\"\")","v":{"$error":"#N/A"}},{"$f":"IF(COLUMN()>=INDIRECT(AQ38),IF(COLUMN()<=INDIRECT(AR38),INDIRECT(AS38),\"\"),\"\")","v":{"$error":"#N/A"}},{"$f":"IF(COLUMN()>=INDIRECT(AQ38),IF(COLUMN()<=INDIRECT(AR38),INDIRECT(AS38),\"\"),\"\")","v":{"$error":"#N/A"}},{"$f":"IF(COLUMN()>=INDIRECT(AQ38),IF(COLUMN()<=INDIRECT(AR38),INDIRECT(AS38),\"\"),\"\")","v":{"$error":"#N/A"}},{"$f":"IF(COLUMN()>=INDIRECT(AQ38),IF(COLUMN()<=INDIRECT(AR38),INDIRECT(AS38),\"\"),\"\")","v":{"$error":"#N/A"}},{"$f":"IF(COLUMN()>=INDIRECT(AQ38),IF(COLUMN()<=INDIRECT(AR38),INDIRECT(AS38),\"\"),\"\")","v":{"$error":"#N/A"}},{"$f":"IF(COLUMN()>=INDIRECT(AQ38),IF(COLUMN()<=INDIRECT(AR38),INDIRECT(AS38),\"\"),\"\")","v":{"$error":"#N/A"}},{"$f":"IF(COLUMN()>=INDIRECT(AQ38),IF(COLUMN()<=INDIRECT(AR38),INDIRECT(AS38),\"\"),\"\")","v":{"$error":"#N/A"}},{"$f":"IF(COLUMN()>=INDIRECT(AQ38),IF(COLUMN()<=INDIRECT(AR38),INDIRECT(AS38),\"\"),\"\")","v":{"$error":"#N/A"}},{"$f":"IF(COLUMN()>=INDIRECT(AQ38),IF(COLUMN()<=INDIRECT(AR38),INDIRECT(AS38),\"\"),\"\")","v":{"$error":"#N/A"}},{"$f":"IF(COLUMN()>=INDIRECT(AQ38),IF(COLUMN()<=INDIRECT(AR38),INDIRECT(AS38),\"\"),\"\")","v":{"$error":"#N/A"}},{"$f":"IF(COLUMN()>=INDIRECT(AQ38),IF(COLUMN()<=INDIRECT(AR38),INDIRECT(AS38),\"\"),\"\")","v":{"$error":"#N/A"}},{"$f":"IF(COLUMN()>=INDIRECT(AQ38),IF(COLUMN()<=INDIRECT(AR38),INDIRECT(AS38),\"\"),\"\")","v":{"$error":"#N/A"}},{"$f":"IF(COLUMN()>=INDIRECT(AQ38),IF(COLUMN()<=INDIRECT(AR38),INDIRECT(AS38),\"\"),\"\")","v":{"$error":"#N/A"}},{"$f":"IF(COLUMN()>=INDIRECT(AQ38),IF(COLUMN()<=INDIRECT(AR38),INDIRECT(AS38),\"\"),\"\")","v":{"$error":"#N/A"}},{"$f":"IF(COLUMN()>=INDIRECT(AQ38),IF(COLUMN()<=INDIRECT(AR38),INDIRECT(AS38),\"\"),\"\")","v":{"$error":"#N/A"}},{"$f":"IF(COLUMN()>=INDIRECT(AQ38),IF(COLUMN()<=INDIRECT(AR38),INDIRECT(AS38),\"\"),\"\")","v":{"$error":"#N/A"}},{"$f":"IF(COLUMN()>=INDIRECT(AQ38),IF(COLUMN()<=INDIRECT(AR38),INDIRECT(AS38),\"\"),\"\")","v":{"$error":"#N/A"}},{"$f":"IF(COLUMN()>=INDIRECT(AQ38),IF(COLUMN()<=INDIRECT(AR38),INDIRECT(AS38),\"\"),\"\")","v":{"$error":"#N/A"}},{"$f":"IF(COLUMN()>=INDIRECT(AQ38),IF(COLUMN()<=INDIRECT(AR38),INDIRECT(AS38),\"\"),\"\")","v":{"$error":"#N/A"}},{"$f":"IF(COLUMN()>=INDIRECT(AQ38),IF(COLUMN()<=INDIRECT(AR38),INDIRECT(AS38),\"\"),\"\")","v":{"$error":"#N/A"}},{"$f":"IF(COLUMN()>=INDIRECT(AQ38),IF(COLUMN()<=INDIRECT(AR38),INDIRECT(AS38),\"\"),\"\")","v":{"$error":"#N/A"}},{"$f":"IF(COLUMN()>=INDIRECT(AQ38),IF(COLUMN()<=INDIRECT(AR38),INDIRECT(AS38),\"\"),\"\")","v":{"$error":"#N/A"}},{"$f":"IF(COLUMN()>=INDIRECT(AQ38),IF(COLUMN()<=INDIRECT(AR38),INDIRECT(AS38),\"\"),\"\")","v":{"$error":"#N/A"}},{"$f":"IF(COLUMN()>=INDIRECT(AQ38),IF(COLUMN()<=INDIRECT(AR38),INDIRECT(AS38),\"\"),\"\")","v":{"$error":"#N/A"}},{"$f":"IF(COLUMN()>=INDIRECT(AQ38),IF(COLUMN()<=INDIRECT(AR38),INDIRECT(AS38),\"\"),\"\")","v":{"$error":"#N/A"}},{"$f":"IF(COLUMN()>=INDIRECT(AQ38),IF(COLUMN()<=INDIRECT(AR38),INDIRECT(AS38),\"\"),\"\")","v":{"$error":"#N/A"}},{"$f":"IF(COLUMN()>=INDIRECT(AQ38),IF(COLUMN()<=INDIRECT(AR38),INDIRECT(AS38),\"\"),\"\")","v":{"$error":"#N/A"}},{"$f":"IF(COLUMN()>=INDIRECT(AQ38),IF(COLUMN()<=INDIRECT(AR38),INDIRECT(AS38),\"\"),\"\")","v":{"$error":"#N/A"}},{"$f":"IF(COLUMN()>=INDIRECT(AQ38),IF(COLUMN()<=INDIRECT(AR38),INDIRECT(AS38),\"\"),\"\")","v":{"$error":"#N/A"}},{"$f":"IF(COLUMN()>=INDIRECT(AQ38),IF(COLUMN()<=INDIRECT(AR38),INDIRECT(AS38),\"\"),\"\")","v":{"$error":"#N/A"}},{"$f":"IF(COLUMN()>=INDIRECT(AQ38),IF(COLUMN()<=INDIRECT(AR38),INDIRECT(AS38),\"\"),\"\")","v":{"$error":"#N/A"}},{"$f":"IF(COLUMN()>=INDIRECT(AQ38),IF(COLUMN()<=INDIRECT(AR38),INDIRECT(AS38),\"\"),\"\")","v":{"$error":"#N/A"}},{"$f":"IF(COLUMN()>=INDIRECT(AQ38),IF(COLUMN()<=INDIRECT(AR38),INDIRECT(AS38),\"\"),\"\")","v":{"$error":"#N/A"}},{"$f":"IF(COLUMN()>=INDIRECT(AQ38),IF(COLUMN()<=INDIRECT(AR38),INDIRECT(AS38),\"\"),\"\")","v":{"$error":"#N/A"}},{"$f":"IF(COLUMN()>=INDIRECT(AQ38),IF(COLUMN()<=INDIRECT(AR38),INDIRECT(AS38),\"\"),\"\")","v":{"$error":"#N/A"}},{"$f":"IF(COLUMN()>=INDIRECT(AQ38),IF(COLUMN()<=INDIRECT(AR38),INDIRECT(AS38),\"\"),\"\")","v":{"$error":"#N/A"}},null,{"$f":"CONCATENATE(\"'\",SUBSTITUTE(SUBSTITUTE(SUBSTITUTE(MID(CELL(\"direccion\",'ETAPA III.a'!M$1),FIND(\"]\",CELL(\"direccion\",'ETAPA III.a'!M$1))+1,LEN(CELL(\"direccion\",'ETAPA III.a'!M$1))),\"$\",\"\"),1,MATCH($A35,'ETAPA III.a'!$K:$K,0)),\"!\",\"!$\"))","v":"'ETAPA III.a'!$M186"},{"$f":"CONCATENATE(\"'\",SUBSTITUTE(SUBSTITUTE(SUBSTITUTE(MID(CELL(\"direccion\",'ETAPA III.a'!N$1),FIND(\"]\",CELL(\"direccion\",'ETAPA III.a'!N$1))+1,LEN(CELL(\"direccion\",'ETAPA III.a'!N$1))),\"$\",\"\"),1,MATCH($A35,'ETAPA III.a'!$K:$K,0)),\"!\",\"!$\"))","v":"'ETAPA III.a'!$N186"},{"$f":"CONCATENATE(\"'\",SUBSTITUTE(SUBSTITUTE(SUBSTITUTE(MID(CELL(\"direccion\",'ETAPA III.a'!L$1),FIND(\"]\",CELL(\"direccion\",'ETAPA III.a'!L$1))+1,LEN(CELL(\"direccion\",'ETAPA III.a'!L$1))),\"$\",\"\"),1,MATCH($A35,'ETAPA III.a'!$K:$K,0)),\"!\",\"!$\"))","v":"'ETAPA III.a'!$L186"}]
[26,{"$f":"IF(COLUMN()>=INDIRECT(AQ36),IF(COLUMN()<=INDIRECT(AR36),INDIRECT(AS36),\"\"),\"\")","v":{"$error":"#N/A"}},{"$f":"IF(COLUMN()>=INDIRECT(AQ36),IF(COLUMN()<=INDIRECT(AR36),INDIRECT(AS36),\"\"),\"\")","v":{"$error":"#N/A"}},{"$f":"IF(COLUMN()>=INDIRECT(AQ36),IF(COLUMN()<=INDIRECT(AR36),INDIRECT(AS36),\"\"),\"\")","v":{"$error":"#N/A"}},{"$f":"IF(COLUMN()>=INDIRECT(AQ36),IF(COLUMN()<=INDIRECT(AR36),INDIRECT(AS36),\"\"),\"\")","v":{"$error":"#N/A"}},{"$f":"IF(COLUMN()>=INDIRECT(AQ36),IF(COLUMN()<=INDIRECT(AR36),INDIRECT(AS36),\"\"),\"\")","v":{"$error":"#N/A"}},{"$f":"IF(COLUMN()>=INDIRECT(AQ36),IF(COLUMN()<=INDIRECT(AR36),INDIRECT(AS36),\"\"),\"\")","v":{"$error":"#N/A"}},{"$f":"IF(COLUMN()>=INDIRECT(AQ36),IF(COLUMN()<=INDIRECT(AR36),INDIRECT(AS36),\"\"),\"\")","v":{"$error":"#N/A"}},{"$f":"IF(COLUMN()>=INDIRECT(AQ36),IF(COLUMN()<=INDIRECT(AR36),INDIRECT(AS36),\"\"),\"\")","v":{"$error":"#N/A"}},{"$f":"IF(COLUMN()>=INDIRECT(AQ36),IF(COLUMN()<=INDIRECT(AR36),INDIRECT(AS36),\"\"),\"\")","v":{"$error":"#N/A"}},{"$f":"IF(COLUMN()>=INDIRECT(AQ36),IF(COLUMN()<=INDIRECT(AR36),INDIRECT(AS36),\"\"),\"\")","v":{"$error":"#N/A"}},{"$f":"IF(COLUMN()>=INDIRECT(AQ36),IF(COLUMN()<=INDIRECT(AR36),INDIRECT(AS36),\"\"),\"\")","v":{"$error":"#N/A"}},{"$f":"IF(COLUMN()>=INDIRECT(AQ36),IF(COLUMN()<=INDIRECT(AR36),INDIRECT(AS36),\"\"),\"\")","v":{"$error":"#N/A"}},{"$f":"IF(COLUMN()>=INDIRECT(AQ36),IF(COLUMN()<=INDIRECT(AR36),INDIRECT(AS36),\"\"),\"\")","v":{"$error":"#N/A"}},{"$f":"IF(COLUMN()>=INDIRECT(AQ36),IF(COLUMN()<=INDIRECT(AR36),INDIRECT(AS36),\"\"),\"\")","v":{"$error":"#N/A"}},{"$f":"IF(COLUMN()>=INDIRECT(AQ36),IF(COLUMN()<=INDIRECT(AR36),INDIRECT(AS36),\"\"),\"\")","v":{"$error":"#N/A"}},{"$f":"IF(COLUMN()>=INDIRECT(AQ36),IF(COLUMN()<=INDIRECT(AR36),INDIRECT(AS36),\"\"),\"\")","v":{"$error":"#N/A"}},{"$f":"IF(COLUMN()>=INDIRECT(AQ36),IF(COLUMN()<=INDIRECT(AR36),INDIRECT(AS36),\"\"),\"\")","v":{"$error":"#N/A"}},{"$f":"IF(COLUMN()>=INDIRECT(AQ36),IF(COLUMN()<=INDIRECT(AR36),INDIRECT(AS36),\"\"),\"\")","v":{"$error":"#N/A"}},{"$f":"IF(COLUMN()>=INDIRECT(AQ36),IF(COLUMN()<=INDIRECT(AR36),INDIRECT(AS36),\"\"),\"\")","v":{"$error":"#N/A"}},{"$f":"IF(COLUMN()>=INDIRECT(AQ36),IF(COLUMN()<=INDIRECT(AR36),INDIRECT(AS36),\"\"),\"\")","v":{"$error":"#N/A"}},{"$f":"IF(COLUMN()>=INDIRECT(AQ36),IF(COLUMN()<=INDIRECT(AR36),INDIRECT(AS36),\"\"),\"\")","v":{"$error":"#N/A"}},{"$f":"IF(COLUMN()>=INDIRECT(AQ36),IF(COLUMN()<=INDIRECT(AR36),INDIRECT(AS36),\"\"),\"\")","v":{"$error":"#N/A"}},{"$f":"IF(COLUMN()>=INDIRECT(AQ36),IF(COLUMN()<=INDIRECT(AR36),INDIRECT(AS36),\"\"),\"\")","v":{"$error":"#N/A"}},{"$f":"IF(COLUMN()>=INDIRECT(AQ36),IF(COLUMN()<=INDIRECT(AR36),INDIRECT(AS36),\"\"),\"\")","v":{"$error":"#N/A"}},{"$f":"IF(COLUMN()>=INDIRECT(AQ36),IF(COLUMN()<=INDIRECT(AR36),INDIRECT(AS36),\"\"),\"\")","v":{"$error":"#N/A"}},{"$f":"IF(COLUMN()>=INDIRECT(AQ36),IF(COLUMN()<=INDIRECT(AR36),INDIRECT(AS36),\"\"),\"\")","v":{"$error":"#N/A"}},{"$f":"IF(COLUMN()>=INDIRECT(AQ36),IF(COLUMN()<=INDIRECT(AR36),INDIRECT(AS36),\"\"),\"\")","v":{"$error":"#N/A"}},{"$f":"IF(COLUMN()>=INDIRECT(AQ36),IF(COLUMN()<=INDIRECT(AR36),INDIRECT(AS36),\"\"),\"\")","v":{"$error":"#N/A"}},{"$f":"IF(COLUMN()>=INDIRECT(AQ36),IF(COLUMN()<=INDIRECT(AR36),INDIRECT(AS36),\"\"),\"\")","v":{"$error":"#N/A"}},{"$f":"IF(COLUMN()>=INDIRECT(AQ36),IF(COLUMN()<=INDIRECT(AR36),INDIRECT(AS36),\"\"),\"\")","v":{"$error":"#N/A"}},{"$f":"IF(COLUMN()>=INDIRECT(AQ36),IF(COLUMN()<=INDIRECT(AR36),INDIRECT(AS36),\"\"),\"\")","v":{"$error":"#N/A"}},{"$f":"IF(COLUMN()>=INDIRECT(AQ36),IF(COLUMN()<=INDIRECT(AR36),INDIRECT(AS36),\"\"),\"\")","v":{"$error":"#N/A"}},{"$f":"IF(COLUMN()>=INDIRECT(AQ36),IF(COLUMN()<=INDIRECT(AR36),INDIRECT(AS36),\"\"),\"\")","v":{"$error":"#N/A"}},{"$f":"IF(COLUMN()>=INDIRECT(AQ36),IF(COLUMN()<=INDIRECT(AR36),INDIRECT(AS36),\"\"),\"\")","v":{"$error":"#N/A"}},{"$f":"IF(COLUMN()>=INDIRECT(AQ36),IF(COLUMN()<=INDIRECT(AR36),INDIRECT(AS36),\"\"),\"\")","v":{"$error":"#N/A"}},{"$f":"IF(COLUMN()>=INDIRECT(AQ36),IF(COLUMN()<=INDIRECT(AR36),INDIRECT(AS36),\"\"),\"\")","v":{"$error":"#N/A"}},{"$f":"IF(COLUMN()>=INDIRECT(AQ36),IF(COLUMN()<=INDIRECT(AR36),INDIRECT(AS36),\"\"),\"\")","v":{"$error":"#N/A"}},{"$f":"IF(COLUMN()>=INDIRECT(AQ36),IF(COLUMN()<=INDIRECT(AR36),INDIRECT(AS36),\"\"),\"\")","v":{"$error":"#N/A"}},{"$f":"IF(COLUMN()>=INDIRECT(AQ36),IF(COLUMN()<=INDIRECT(AR36),INDIRECT(AS36),\"\"),\"\")","v":{"$error":"#N/A"}},{"$f":"IF(COLUMN()>=INDIRECT(AQ36),IF(COLUMN()<=INDIRECT(AR36),INDIRECT(AS36),\"\"),\"\")","v":{"$error":"#N/A"}},null,{"$f":"CONCATENATE(\"'\",SUBSTITUTE(SUBSTITUTE(SUBSTITUTE(MID(CELL(\"direccion\",'ETAPA III.a'!M$1),FIND(\"]\",CELL(\"direccion\",'ETAPA III.a'!M$1))+1,LEN(CELL(\"direccion\",'ETAPA III.a'!M$1))),\"$\",\"\"),1,MATCH($A36,'ETAPA III.a'!$K:$K,0)),\"!\",\"!$\"))","v":"'ETAPA III.a'!$M193"},{"$f":"CONCATENATE(\"'\",SUBSTITUTE(SUBSTITUTE(SUBSTITUTE(MID(CELL(\"direccion\",'ETAPA III.a'!N$1),FIND(\"]\",CELL(\"direccion\",'ETAPA III.a'!N$1))+1,LEN(CELL(\"direccion\",'ETAPA III.a'!N$1))),\"$\",\"\"),1,MATCH($A36,'ETAPA III.a'!$K:$K,0)),\"!\",\"!$\"))","v":"'ETAPA III.a'!$N193"},{"$f":"CONCATENATE(\"'\",SUBSTITUTE(SUBSTITUTE(SUBSTITUTE(MID(CELL(\"direccion\",'ETAPA III.a'!L$1),FIND(\"]\",CELL(\"direccion\",'ETAPA III.a'!L$1))+1,LEN(CELL(\"direccion\",'ETAPA III.a'!L$1))),\"$\",\"\"),1,MATCH($A36,'ETAPA III.a'!$K:$K,0)),\"!\",\"!$\"))","v":"'ETAPA III.a'!$L193"}]
[27,{"$f":"IF(COLUMN()>=INDIRECT(AQ37),IF(COLUMN()<=INDIRECT(AR37),INDIRECT(AS37),\"\"),\"\")","v":{"$error":"#N/A"}},{"$f":"IF(COLUMN()>=INDIRECT(AQ37),IF(COLUMN()<=INDIRECT(AR37),INDIRECT(AS37),\"\"),\"\")","v":{"$error":"#N/A"}},{"$f":"IF(COLUMN()>=INDIRECT(AQ37),IF(COLUMN()<=INDIRECT(AR37),INDIRECT(AS37),\"\"),\"\")","v":{"$error":"#N/A"}},{"$f":"IF(COLUMN()>=INDIRECT(AQ37),IF(COLUMN()<=INDIRECT(AR37),INDIRECT(AS37),\"\"),\"\")","v":{"$error":"#N/A"}},{"$f":"IF(COLUMN()>=INDIRECT(AQ37),IF(COLUMN()<=INDIRECT(AR37),INDIRECT(AS37),\"\"),\"\")","v":{"$error":"#N/A"}},{"$f":"IF(COLUMN()>=INDIRECT(AQ37),IF(COLUMN()<=INDIRECT(AR37),INDIRECT(AS37),\"\"),\"\")","v":{"$error":"#N/A"}},{"$f":"IF(COLUMN()>=INDIRECT(AQ37),IF(COLUMN()<=INDIRECT(AR37),INDIRECT(AS37),\"\"),\"\")","v":{"$error":"#N/A"}},{"$f":"IF(COLUMN()>=INDIRECT(AQ37),IF(COLUMN()<=INDIRECT(AR37),INDIRECT(AS37),\"\"),\"\")","v":{"$error":"#N/A"}},{"$f":"IF(COLUMN()>=INDIRECT(AQ37),IF(COLUMN()<=INDIRECT(AR37),INDIRECT(AS37),\"\"),\"\")","v":{"$error":"#N/A"}},{"$f":"IF(COLUMN()>=INDIRECT(AQ37),IF(COLUMN()<=INDIRECT(AR37),INDIRECT(AS37),\"\"),\"\")","v":{"$error":"#N/A"}},{"$f":"IF(COLUMN()>=INDIRECT(AQ37),IF(COLUMN()<=INDIRECT(AR37),INDIRECT(AS37),\"\"),\"\")","v":{"$error":"#N/A"}},{"$f":"IF(COLUMN()>=INDIRECT(AQ37),IF(COLUMN()<=INDIRECT(AR37),INDIRECT(AS37),\"\"),\"\")","v":{"$error":"#N/A"}},{"$f":"IF(COLUMN()>=INDIRECT(AQ37),IF(COLUMN()<=INDIRECT(AR37),INDIRECT(AS37),\"\"),\"\")","v":{"$error":"#N/A"}},{"$f":"IF(COLUMN()>=INDIRECT(AQ37),IF(COLUMN()<=INDIRECT(AR37),INDIRECT(AS37),\"\"),\"\")","v":{"$error":"#N/A"}},{"$f":"IF(COLUMN()>=INDIRECT(AQ37),IF(COLUMN()<=INDIRECT(AR37),INDIRECT(AS37),\"\"),\"\")","v":{"$error":"#N/A"}},{"$f":"IF(COLUMN()>=INDIRECT(AQ37),IF(COLUMN()<=INDIRECT(AR37),INDIRECT(AS37),\"\"),\"\")","v":{"$error":"#N/A"}},{"$f":"IF(COLUMN()>=INDIRECT(AQ37),IF(COLUMN()<=INDIRECT(AR37),INDIRECT(AS37),\"\"),\"\")","v":{"$error":"#N/A"}},{"$f":"IF(COLUMN()>=INDIRECT(AQ37),IF(COLUMN()<=INDIRECT(AR37),INDIRECT(AS37),\"\"),\"\")","v":{"$error":"#N/A"}},{"$f":"IF(COLUMN()>=INDIRECT(AQ37),IF(COLUMN()<=INDIRECT(AR37),INDIRECT(AS37),\"\"),\"\")","v":{"$error":"#N/A"}},{"$f":"IF(COLUMN()>=INDIRECT(AQ37),IF(COLUMN()<=INDIRECT(AR37),INDIRECT(AS37),\"\"),\"\")","v":{"$error":"#N/A"}},{"$f":"IF(COLUMN()>=INDIRECT(AQ37),IF(COLUMN()<=INDIRECT(AR37),INDIRECT(AS37),\"\"),\"\")","v":{"$error":"#N/A"}},{"$f":"IF(COLUMN()>=INDIRECT(AQ37),IF(COLUMN()<=INDIRECT(AR37),INDIRECT(AS37),\"\"),\"\")","v":{"$error":"#N/A"}},{"$f":"IF(COLUMN()>=INDIRECT(AQ37),IF(COLUMN()<=INDIRECT(AR37),INDIRECT(AS37),\"\"),\"\")","v":{"$error":"#N/A"}},{"$f":"IF(COLUMN()>=INDIRECT(AQ37),IF(COLUMN()<=INDIRECT(AR37),INDIRECT(AS37),\"\"),\"\")","v":{"$error":"#N/A"}},{"$f":"IF(COLUMN()>=INDIRECT(AQ37),IF(COLUMN()<=INDIRECT(AR37),INDIRECT(AS37),\"\"),\"\")","v":{"$error":"#N/A"}},{"$f":"IF(COLUMN()>=INDIRECT(AQ37),IF(COLUMN()<=INDIRECT(AR37),INDIRECT(AS37),\"\"),\"\")","v":{"$error":"#N/A"}},{"$f":"IF(COLUMN()>=INDIRECT(AQ37),IF(COLUMN()<=INDIRECT(AR37),INDIRECT(AS37),\"\"),\"\")","v":{"$error":"#N/A"}},{"$f":"IF(COLUMN()>=INDIRECT(AQ37),IF(COLUMN()<=INDIRECT(AR37),INDIRECT(AS37),\"\"),\"\")","v":{"$error":"#N/A"}},{"$f":"IF(COLUMN()>=INDIRECT(AQ37),IF(COLUMN()<=INDIRECT(AR37),INDIRECT(AS37),\"\"),\"\")","v":{"$error":"#N/A"}},{"$f":"IF(COLUMN()>=INDIRECT(AQ37),IF(COLUMN()<=INDIRECT(AR37),INDIRECT(AS37),\"\"),\"\")","v":{"$error":"#N/A"}},{"$f":"IF(COLUMN()>=INDIRECT(AQ37),IF(COLUMN()<=INDIRECT(AR37),INDIRECT(AS37),\"\"),\"\")","v":{"$error":"#N/A"}},{"$f":"IF(COLUMN()>=INDIRECT(AQ37),IF(COLUMN()<=INDIRECT(AR37),INDIRECT(AS37),\"\"),\"\")","v":{"$error":"#N/A"}},{"$f":"IF(COLUMN()>=INDIRECT(AQ37),IF(COLUMN()<=INDIRECT(AR37),INDIRECT(AS37),\"\"),\"\")","v":{"$error":"#N/A"}},{"$f":"IF(COLUMN()>=INDIRECT(AQ37),IF(COLUMN()<=INDIRECT(AR37),INDIRECT(AS37),\"\"),\"\")","v":{"$error":"#N/A"}},{"$f":"IF(COLUMN()>=INDIRECT(AQ37),IF(COLUMN()<=INDIRECT(AR37),INDIRECT(AS37),\"\"),\"\")","v":{"$error":"#N/A"}},{"$f":"IF(COLUMN()>=INDIRECT(AQ37),IF(COLUMN()<=INDIRECT(AR37),INDIRECT(AS37),\"\"),\"\")","v":{"$error":"#N/A"}},{"$f":"IF(COLUMN()>=INDIRECT(AQ37),IF(COLUMN()<=INDIRECT(AR37),INDIRECT(AS37),\"\"),\"\")","v":{"$error":"#N/A"}},{"$f":"IF(COLUMN()>=INDIRECT(AQ37),IF(COLUMN()<=INDIRECT(AR37),INDIRECT(AS37),\"\"),\"\")","v":{"$error":"#N/A"}},{"$f":"IF(COLUMN()>=INDIRECT(AQ37),IF(COLUMN()<=INDIRECT(AR37),INDIRECT(AS37),\"\"),\"\")","v":{"$error":"#N/A"}},{"$f":"IF(COLUMN()>=INDIRECT(AQ37),IF(COLUMN()<=INDIRECT(AR37),INDIRECT(AS37),\"\"),\"\")","v":{"$error":"#N/A"}},null,{"$f":"CONCATENATE(\"'\",SUBSTITUTE(SUBSTITUTE(SUBSTITUTE(MID(CELL(\"direccion\",'ETAPA III.a'!M$1),FIND(\"]\",CELL(\"direccion\",'ETAPA III.a'!M$1))+1,LEN(CELL(\"direccion\",'ETAPA III.a'!M$1))),\"$\",\"\"),1,MATCH($A37,'ETAPA III.a'!$K:$K,0)),\"!\",\"!$\"))","v":"'ETAPA III.a'!$M200"},{"$f":"CONCATENATE(\"'\",SUBSTITUTE(SUBSTITUTE(SUBSTITUTE(MID(CELL(\"direccion\",'ETAPA III.a'!N$1),FIND(\"]\",CELL(\"direccion\",'ETAPA III.a'!N$1))+1,LEN(CELL(\"direccion\",'ETAPA III.a'!N$1))),\"$\",\"\"),1,MATCH($A37,'ETAPA III.a'!$K:$K,0)),\"!\",\"!$\"))","v":"'ETAPA III.a'!$N200"},{"$f":"CONCATENATE(\"'\",SUBSTITUTE(SUBSTITUTE(SUBSTITUTE(MID(CELL(\"direccion\",'ETAPA III.a'!L$1),FIND(\"]\",CELL(\"direccion\",'ETAPA III.a'!L$1))+1,LEN(CELL(\"direccion\",'ETAPA III.a'!L$1))),\"$\",\"\"),1,MATCH($A37,'ETAPA III.a'!$K:$K,0)),\"!\",\"!$\"))","v":"'ETAPA III.a'!$L200"}]
[28,{"$f":"IF(COLUMN()>=INDIRECT(AQ38),IF(COLUMN()<=INDIRECT(AR38),INDIRECT(AS38),\"\"),\"\")","v":{"$error":"#N/A"}},{"$f":"IF(COLUMN()>=INDIRECT(AQ38),IF(COLUMN()<=INDIRECT(AR38),INDIRECT(AS38),\"\"),\"\")","v":{"$error":"#N/A"}},{"$f":"IF(COLUMN()>=INDIRECT(AQ38),IF(COLUMN()<=INDIRECT(AR38),INDIRECT(AS38),\"\"),\"\")","v":{"$error":"#N/A"}},{"$f":"IF(COLUMN()>=INDIRECT(AQ38),IF(COLUMN()<=INDIRECT(AR38),INDIRECT(AS38),\"\"),\"\")","v":{"$error":"#N/A"}},{"$f":"IF(COLUMN()>=INDIRECT(AQ38),IF(COLUMN()<=INDIRECT(AR38),INDIRECT(AS38),\"\"),\"\")","v":{"$error":"#N/A"}},{"$f":"IF(COLUMN()>=INDIRECT(AQ38),IF(COLUMN()<=INDIRECT(AR38),INDIRECT(AS38),\"\"),\"\")","v":{"$error":"#N/A"}},{"$f":"IF(COLUMN()>=INDIRECT(AQ38),IF(COLUMN()<=INDIRECT(AR38),INDIRECT(AS38),\"\"),\"\")","v":{"$error":"#N/A"}},{"$f":"IF(COLUMN()>=INDIRECT(AQ38),IF(COLUMN()<=INDIRECT(AR38),INDIRECT(AS38),\"\"),\"\")","v":{"$error":"#N/A"}},{"$f":"IF(COLUMN()>=INDIRECT(AQ38),IF(COLUMN()<=INDIRECT(AR38),INDIRECT(AS38),\"\"),\"\")","v":{"$error":"#N/A"}},{"$f":"IF(COLUMN()>=INDIRECT(AQ38),IF(COLUMN()<=INDIRECT(AR38),INDIRECT(AS38),\"\"),\"\")","v":{"$error":"#N/A"}},{"$f":"IF(COLUMN()>=INDIRECT(AQ38),IF(COLUMN()<=INDIRECT(AR38),INDIRECT(AS38),\"\"),\"\")","v":{"$error":"#N/A"}},{"$f":"IF(COLUMN()>=INDIRECT(AQ38),IF(COLUMN()<=INDIRECT(AR38),INDIRECT(AS38),\"\"),\"\")","v":{"$error":"#N/A"}},{"$f":"IF(COLUMN()>=INDIRECT(AQ38),IF(COLUMN()<=INDIRECT(AR38),INDIRECT(AS38),\"\"),\"\")","v":{"$error":"#N/A"}},{"$f":"IF(COLUMN()>=INDIRECT(AQ38),IF(COLUMN()<=INDIRECT(AR38),INDIRECT(AS38),\"\"),\"\")","v":{"$error":"#N/A"}},{"$f":"IF(COLUMN()>=INDIRECT(AQ38),IF(COLUMN()<=INDIRECT(AR38),INDIRECT(AS38),\"\"),\"\")","v":{"$error":"#N/A"}},{"$f":"IF(COLUMN()>=INDIRECT(AQ38),IF(COLUMN()<=INDIRECT(AR38),INDIRECT(AS38),\"\"),\"\")","v":{"$error":"#N/A"}},{"$f":"IF(COLUMN()>=INDIRECT(AQ38),IF(COLUMN()<=INDIRECT(AR38),INDIRECT(AS38),\"\"),\"\")","v":{"$error":"#N/A"}},{"$f":"IF(COLUMN()>=INDIRECT(AQ38),IF(COLUMN()<=INDIRECT(AR38),INDIRECT(AS38),\"\"),\"\")","v":{"$error":"#N/A"}},{"$f":"IF(COLUMN()>=INDIRECT(AQ38),IF(COLUMN()<=INDIRECT(AR38),INDIRECT(AS38),\"\"),\"\")","v":{"$error":"#N/A"}},{"$f":"IF(COLUMN()>=INDIRECT(AQ38),IF(COLUMN()<=INDIRECT(AR38),INDIRECT(AS38),\"\"),\"\")","v":{"$error":"#N/A"}},{"$f":"IF(COLUMN()>=INDIRECT(AQ38),IF(COLUMN()<=INDIRECT(AR38),INDIRECT(AS38),\"\"),\"\")","v":{"$error":"#N/A"}},{"$f":"IF(COLUMN()>=INDIRECT(AQ38),IF(COLUMN()<=INDIRECT(AR38),INDIRECT(AS38),\"\"),\"\")","v":{"$error":"#N/A"}},{"$f":"IF(COLUMN()>=INDIRECT(AQ38),IF(COLUMN()<=INDIRECT(AR38),INDIRECT(AS38),\"\"),\"\")","v":{"$error":"#N/A"}},{"$f":"IF(COLUMN()>=INDIRECT(AQ38),IF(COLUMN()<=INDIRECT(AR38),INDIRECT(AS38),\"\"),\"\")","v":{"$error":"#N/A"}},{"$f":"IF(COLUMN()>=INDIRECT(AQ38),IF(COLUMN()<=INDIRECT(AR38),INDIRECT(AS38),\"\"),\"\")","v":{"$error":"#N/A"}},{"$f":"IF(COLUMN()>=INDIRECT(AQ38),IF(COLUMN()<=INDIRECT(AR38),INDIRECT(AS38),\"\"),\"\")","v":{"$error":"#N/A"}},{"$f":"IF(COLUMN()>=INDIRECT(AQ38),IF(COLUMN()<=INDIRECT(AR38),INDIRECT(AS38),\"\"),\"\")","v":{"$error":"#N/A"}},{"$f":"IF(COLUMN()>=INDIRECT(AQ38),IF(COLUMN()<=INDIRECT(AR38),INDIRECT(AS38),\"\"),\"\")","v":{"$error":"#N/A"}},{"$f":"IF(COLUMN()>=INDIRECT(AQ38),IF(COLUMN()<=INDIRECT(AR38),INDIRECT(AS38),\"\"),\"\")","v":{"$error":"#N/A"}},{"$f":"IF(COLUMN()>=INDIRECT(AQ38),IF(COLUMN()<=INDIRECT(AR38),INDIRECT(AS38),\"\"),\"\")","v":{"$error":"#N/A"}},{"$f":"IF(COLUMN()>=INDIRECT(AQ38),IF(COLUMN()<=INDIRECT(AR38),INDIRECT(AS38),\"\"),\"\")","v":{"$error":"#N/A"}},{"$f":"IF(COLUMN()>=INDIRECT(AQ38),IF(COLUMN()<=INDIRECT(AR38),INDIRECT(AS38),\"\"),\"\")","v":{"$error":"#N/A"}},{"$f":"IF(COLUMN()>=INDIRECT(AQ38),IF(COLUMN()<=INDIRECT(AR38),INDIRECT(AS38),\"\"),\"\")","v":{"$error":"#N/A"}},{"$f":"IF(COLUMN()>=INDIRECT(AQ38),IF(COLUMN()<=INDIRECT(AR38),INDIRECT(AS38),\"\"),\"\")","v":{"$error":"#N/A"}},{"$f":"IF(COLUMN()>=INDIRECT(AQ38),IF(COLUMN()<=INDIRECT(AR38),INDIRECT(AS38),\"\"),\"\")","v":{"$error":"#N/A"}},{"$f":"IF(COLUMN()>=INDIRECT(AQ38),IF(COLUMN()<=INDIRECT(AR38),INDIRECT(AS38),\"\"),\"\")","v":{"$error":"#N/A"}},{"$f":"IF(COLUMN()>=INDIRECT(AQ38),IF(COLUMN()<=INDIRECT(AR38),INDIRECT(AS38),\"\"),\"\")","v":{"$error":"#N/A"}},{"$f":"IF(COLUMN()>=INDIRECT(AQ38),IF(COLUMN()<=INDIRECT(AR38),INDIRECT(AS38),\"\"),\"\")","v":{"$error":"#N/A"}},{"$f":"IF(COLUMN()>=INDIRECT(AQ38),IF(COLUMN()<=INDIRECT(AR38),INDIRECT(AS38),\"\"),\"\")","v":{"$error":"#N/A"}},{"$f":"IF(COLUMN()>=INDIRECT(AQ38),IF(COLUMN()<=INDIRECT(AR38),INDIRECT(AS38),\"\"),\"\")","v":{"$error":"#N/A"}},null,{"$f":"CONCATENATE(\"'\",SUBSTITUTE(SUBSTITUTE(SUBSTITUTE(MID(CELL(\"direccion\",'ETAPA III.a'!M$1),FIND(\"]\",CELL(\"direccion\",'ETAPA III.a'!M$1))+1,LEN(CELL(\"direccion\",'ETAPA III.a'!M$1))),\"$\",\"\"),1,MATCH($A38,'ETAPA III.a'!$K:$K,0)),\"!\",\"!$\"))","v":"'ETAPA III.a'!$M207"},{"$f":"CONCATENATE(\"'\",SUBSTITUTE(SUBSTITUTE(SUBSTITUTE(MID(CELL(\"direccion\",'ETAPA III.a'!N$1),FIND(\"]\",CELL(\"direccion\",'ETAPA III.a'!N$1))+1,LEN(CELL(\"direccion\",'ETAPA III.a'!N$1))),\"$\",\"\"),1,MATCH($A38,'ETAPA III.a'!$K:$K,0)),\"!\",\"!$\"))","v":"'ETAPA III.a'!$N207"},{"$f":"CONCATENATE(\"'\",SUBSTITUTE(SUBSTITUTE(SUBSTITUTE(MID(CELL(\"direccion\",'ETAPA III.a'!L$1),FIND(\"]\",CELL(\"direccion\",'ETAPA III.a'!L$1))+1,LEN(CELL(\"direccion\",'ETAPA III.a'!L$1))),\"$\",\"\"),1,MATCH($A38,'ETAPA III.a'!$K:$K,0)),\"!\",\"!$\"))","v":"'ETAPA III.a'!$L207"}]
[29,{"$f":"IF(COLUMN()>=INDIRECT(AQ39),IF(COLUMN()<=INDIRECT(AR39),INDIRECT(AS39),\"\"),\"\")","v":{"$error":"#N/A"}},{"$f":"IF(COLUMN()>=INDIRECT(AQ39),IF(COLUMN()<=INDIRECT(AR39),INDIRECT(AS39),\"\"),\"\")","v":{"$error":"#N/A"}},{"$f":"IF(COLUMN()>=INDIRECT(AQ39),IF(COLUMN()<=INDIRECT(AR39),INDIRECT(AS39),\"\"),\"\")","v":{"$error":"#N/A"}},{"$f":"IF(COLUMN()>=INDIRECT(AQ39),IF(COLUMN()<=INDIRECT(AR39),INDIRECT(AS39),\"\"),\"\")","v":{"$error":"#N/A"}},{"$f":"IF(COLUMN()>=INDIRECT(AQ39),IF(COLUMN()<=INDIRECT(AR39),INDIRECT(AS39),\"\"),\"\")","v":{"$error":"#N/A"}},{"$f":"IF(COLUMN()>=INDIRECT(AQ39),IF(COLUMN()<=INDIRECT(AR39),INDIRECT(AS39),\"\"),\"\")","v":{"$error":"#N/A"}},{"$f":"IF(COLUMN()>=INDIRECT(AQ39),IF(COLUMN()<=INDIRECT(AR39),INDIRECT(AS39),\"\"),\"\")","v":{"$error":"#N/A"}},{"$f":"IF(COLUMN()>=INDIRECT(AQ39),IF(COLUMN()<=INDIRECT(AR39),INDIRECT(AS39),\"\"),\"\")","v":{"$error":"#N/A"}},{"$f":"IF(COLUMN()>=INDIRECT(AQ39),IF(COLUMN()<=INDIRECT(AR39),INDIRECT(AS39),\"\"),\"\")","v":{"$error":"#N/A"}},{"$f":"IF(COLUMN()>=INDIRECT(AQ39),IF(COLUMN()<=INDIRECT(AR39),INDIRECT(AS39),\"\"),\"\")","v":{"$error":"#N/A"}},{"$f":"IF(COLUMN()>=INDIRECT(AQ39),IF(COLUMN()<=INDIRECT(AR39),INDIRECT(AS39),\"\"),\"\")","v":{"$error":"#N/A"}},{"$f":"IF(COLUMN()>=INDIRECT(AQ39),IF(COLUMN()<=INDIRECT(AR39),INDIRECT(AS39),\"\"),\"\")","v":{"$error":"#N/A"}},{"$f":"IF(COLUMN()>=INDIRECT(AQ39),IF(COLUMN()<=INDIRECT(AR39),INDIRECT(AS39),\"\"),\"\")","v":{"$error":"#N/A"}},{"$f":"IF(COLUMN()>=INDIRECT(AQ39),IF(COLUMN()<=INDIRECT(AR39),INDIRECT(AS39),\"\"),\"\")","v":{"$error":"#N/A"}},{"$f":"IF(COLUMN()>=INDIRECT(AQ39),IF(COLUMN()<=INDIRECT(AR39),INDIRECT(AS39),\"\"),\"\")","v":{"$error":"#N/A"}},{"$f":"IF(COLUMN()>=INDIRECT(AQ39),IF(COLUMN()<=INDIRECT(AR39),INDIRECT(AS39),\"\"),\"\")","v":{"$error":"#N/A"}},{"$f":"IF(COLUMN()>=INDIRECT(AQ39),IF(COLUMN()<=INDIRECT(AR39),INDIRECT(AS39),\"\"),\"\")","v":{"$error":"#N/A"}},{"$f":"IF(COLUMN()>=INDIRECT(AQ39),IF(COLUMN()<=INDIRECT(AR39),INDIRECT(AS39),\"\"),\"\")","v":{"$error":"#N/A"}},{"$f":"IF(COLUMN()>=INDIRECT(AQ39),IF(COLUMN()<=INDIRECT(AR39),INDIRECT(AS39),\"\"),\"\")","v":{"$error":"#N/A"}},{"$f":"IF(COLUMN()>=INDIRECT(AQ39),IF(COLUMN()<=INDIRECT(AR39),INDIRECT(AS39),\"\"),\"\")","v":{"$error":"#N/A"}},{"$f":"IF(COLUMN()>=INDIRECT(AQ39),IF(COLUMN()<=INDIRECT(AR39),INDIRECT(AS39),\"\"),\"\")","v":{"$error":"#N/A"}},{"$f":"IF(COLUMN()>=INDIRECT(AQ39),IF(COLUMN()<=INDIRECT(AR39),INDIRECT(AS39),\"\"),\"\")","v":{"$error":"#N/A"}},{"$f":"IF(COLUMN()>=INDIRECT(AQ39),IF(COLUMN()<=INDIRECT(AR39),INDIRECT(AS39),\"\"),\"\")","v":{"$error":"#N/A"}},{"$f":"IF(COLUMN()>=INDIRECT(AQ39),IF(COLUMN()<=INDIRECT(AR39),INDIRECT(AS39),\"\"),\"\")","v":{"$error":"#N/A"}},{"$f":"IF(COLUMN()>=INDIRECT(AQ39),IF(COLUMN()<=INDIRECT(AR39),INDIRECT(AS39),\"\"),\"\")","v":{"$error":"#N/A"}},{"$f":"IF(COLUMN()>=INDIRECT(AQ39),IF(COLUMN()<=INDIRECT(AR39),INDIRECT(AS39),\"\"),\"\")","v":{"$error":"#N/A"}},{"$f":"IF(COLUMN()>=INDIRECT(AQ39),IF(COLUMN()<=INDIRECT(AR39),INDIRECT(AS39),\"\"),\"\")","v":{"$error":"#N/A"}},{"$f":"IF(COLUMN()>=INDIRECT(AQ39),IF(COLUMN()<=INDIRECT(AR39),INDIRECT(AS39),\"\"),\"\")","v":{"$error":"#N/A"}},{"$f":"IF(COLUMN()>=INDIRECT(AQ39),IF(COLUMN()<=INDIRECT(AR39),INDIRECT(AS39),\"\"),\"\")","v":{"$error":"#N/A"}},{"$f":"IF(COLUMN()>=INDIRECT(AQ39),IF(COLUMN()<=INDIRECT(AR39),INDIRECT(AS39),\"\"),\"\")","v":{"$error":"#N/A"}},{"$f":"IF(COLUMN()>=INDIRECT(AQ39),IF(COLUMN()<=INDIRECT(AR39),INDIRECT(AS39),\"\"),\"\")","v":{"$error":"#N/A"}},{"$f":"IF(COLUMN()>=INDIRECT(AQ39),IF(COLUMN()<=INDIRECT(AR39),INDIRECT(AS39),\"\"),\"\")","v":{"$error":"#N/A"}},{"$f":"IF(COLUMN()>=INDIRECT(AQ39),IF(COLUMN()<=INDIRECT(AR39),INDIRECT(AS39),\"\"),\"\")","v":{"$error":"#N/A"}},{"$f":"IF(COLUMN()>=INDIRECT(AQ39),IF(COLUMN()<=INDIRECT(AR39),INDIRECT(AS39),\"\"),\"\")","v":{"$error":"#N/A"}},{"$f":"IF(COLUMN()>=INDIRECT(AQ39),IF(COLUMN()<=INDIRECT(AR39),INDIRECT(AS39),\"\"),\"\")","v":{"$error":"#N/A"}},{"$f":"IF(COLUMN()>=INDIRECT(AQ39),IF(COLUMN()<=INDIRECT(AR39),INDIRECT(AS39),\"\"),\"\")","v":{"$error":"#N/A"}},{"$f":"IF(COLUMN()>=INDIRECT(AQ39),IF(COLUMN()<=INDIRECT(AR39),INDIRECT(AS39),\"\"),\"\")","v":{"$error":"#N/A"}},{"$f":"IF(COLUMN()>=INDIRECT(AQ39),IF(COLUMN()<=INDIRECT(AR39),INDIRECT(AS39),\"\"),\"\")","v":{"$error":"#N/A"}},{"$f":"IF(COLUMN()>=INDIRECT(AQ39),IF(COLUMN()<=INDIRECT(AR39),INDIRECT(AS39),\"\"),\"\")","v":{"$error":"#N/A"}},{"$f":"IF(COLUMN()>=INDIRECT(AQ39),IF(COLUMN()<=INDIRECT(AR39),INDIRECT(AS39),\"\"),\"\")","v":{"$error":"#N/A"}},null,{"$f":"CONCATENATE(\"'\",SUBSTITUTE(SUBSTITUTE(SUBSTITUTE(MID(CELL(\"direccion\",'ETAPA III.a'!M$1),FIND(\"]\",CELL(\"direccion\",'ETAPA III.a'!M$1))+1,LEN(CELL(\"direccion\",'ETAPA III.a'!M$1))),\"$\",\"\"),1,MATCH($A39,'ETAPA III.a'!$K:$K,0)),\"!\",\"!$\"))","v":"'ETAPA III.a'!$M214"},{"$f":"CONCATENATE(\"'\",SUBSTITUTE(SUBSTITUTE(SUBSTITUTE(MID(CELL(\"direccion\",'ETAPA III.a'!N$1),FIND(\"]\",CELL(\"direccion\",'ETAPA III.a'!N$1))+1,LEN(CELL(\"direccion\",'ETAPA III.a'!N$1))),\"$\",\"\"),1,MATCH($A39,'ETAPA III.a'!$K:$K,0)),\"!\",\"!$\"))","v":"'ETAPA III.a'!$N214"},{"$f":"CONCATENATE(\"'\",SUBSTITUTE(SUBSTITUTE(SUBSTITUTE(MID(CELL(\"direccion\",'ETAPA III.a'!L$1),FIND(\"]\",CELL(\"direccion\",'ETAPA III.a'!L$1))+1,LEN(CELL(\"direccion\",'ETAPA III.a'!L$1))),\"$\",\"\"),1,MATCH($A39,'ETAPA III.a'!$K:$K,0)),\"!\",\"!$\"))","v":"'ETAPA III.a'!$L214"}]
[30,{"$f":"IF(COLUMN()>=INDIRECT(AQ40),IF(COLUMN()<=INDIRECT(AR40),INDIRECT(AS40),\"\"),\"\")","v":{"$error":"#N/A"}},{"$f":"IF(COLUMN()>=INDIRECT(AQ40),IF(COLUMN()<=INDIRECT(AR40),INDIRECT(AS40),\"\"),\"\")","v":{"$error":"#N/A"}},{"$f":"IF(COLUMN()>=INDIRECT(AQ40),IF(COLUMN()<=INDIRECT(AR40),INDIRECT(AS40),\"\"),\"\")","v":{"$error":"#N/A"}},{"$f":"IF(COLUMN()>=INDIRECT(AQ40),IF(COLUMN()<=INDIRECT(AR40),INDIRECT(AS40),\"\"),\"\")","v":{"$error":"#N/A"}},{"$f":"IF(COLUMN()>=INDIRECT(AQ40),IF(COLUMN()<=INDIRECT(AR40),INDIRECT(AS40),\"\"),\"\")","v":{"$error":"#N/A"}},{"$f":"IF(COLUMN()>=INDIRECT(AQ40),IF(COLUMN()<=INDIRECT(AR40),INDIRECT(AS40),\"\"),\"\")","v":{"$error":"#N/A"}},{"$f":"IF(COLUMN()>=INDIRECT(AQ40),IF(COLUMN()<=INDIRECT(AR40),INDIRECT(AS40),\"\"),\"\")","v":{"$error":"#N/A"}},{"$f":"IF(COLUMN()>=INDIRECT(AQ40),IF(COLUMN()<=INDIRECT(AR40),INDIRECT(AS40),\"\"),\"\")","v":{"$error":"#N/A"}},{"$f":"IF(COLUMN()>=INDIRECT(AQ40),IF(COLUMN()<=INDIRECT(AR40),INDIRECT(AS40),\"\"),\"\")","v":{"$error":"#N/A"}},{"$f":"IF(COLUMN()>=INDIRECT(AQ40),IF(COLUMN()<=INDIRECT(AR40),INDIRECT(AS40),\"\"),\"\")","v":{"$error":"#N/A"}},{"$f":"IF(COLUMN()>=INDIRECT(AQ40),IF(COLUMN()<=INDIRECT(AR40),INDIRECT(AS40),\"\"),\"\")","v":{"$error":"#N/A"}},{"$f":"IF(COLUMN()>=INDIRECT(AQ40),IF(COLUMN()<=INDIRECT(AR40),INDIRECT(AS40),\"\"),\"\")","v":{"$error":"#N/A"}},{"$f":"IF(COLUMN()>=INDIRECT(AQ40),IF(COLUMN()<=INDIRECT(AR40),INDIRECT(AS40),\"\"),\"\")","v":{"$error":"#N/A"}},{"$f":"IF(COLUMN()>=INDIRECT(AQ40),IF(COLUMN()<=INDIRECT(AR40),INDIRECT(AS40),\"\"),\"\")","v":{"$error":"#N/A"}},{"$f":"IF(COLUMN()>=INDIRECT(AQ40),IF(COLUMN()<=INDIRECT(AR40),INDIRECT(AS40),\"\"),\"\")","v":{"$error":"#N/A"}},{"$f":"IF(COLUMN()>=INDIRECT(AQ40),IF(COLUMN()<=INDIRECT(AR40),INDIRECT(AS40),\"\"),\"\")","v":{"$error":"#N/A"}},{"$f":"IF(COLUMN()>=INDIRECT(AQ40),IF(COLUMN()<=INDIRECT(AR40),INDIRECT(AS40),\"\"),\"\")","v":{"$error":"#N/A"}},{"$f":"IF(COLUMN()>=INDIRECT(AQ40),IF(COLUMN()<=INDIRECT(AR40),INDIRECT(AS40),\"\"),\"\")","v":{"$error":"#N/A"}},{"$f":"IF(COLUMN()>=INDIRECT(AQ40),IF(COLUMN()<=INDIRECT(AR40),INDIRECT(AS40),\"\"),\"\")","v":{"$error":"#N/A"}},{"$f":"IF(COLUMN()>=INDIRECT(AQ40),IF(COLUMN()<=INDIRECT(AR40),INDIRECT(AS40),\"\"),\"\")","v":{"$error":"#N/A"}},{"$f":"IF(COLUMN()>=INDIRECT(AQ40),IF(COLUMN()<=INDIRECT(AR40),INDIRECT(AS40),\"\"),\"\")","v":{"$error":"#N/A"}},{"$f":"IF(COLUMN()>=INDIRECT(AQ40),IF(COLUMN()<=INDIRECT(AR40),INDIRECT(AS40),\"\"),\"\")","v":{"$error":"#N/A"}},{"$f":"IF(COLUMN()>=INDIRECT(AQ40),IF(COLUMN()<=INDIRECT(AR40),INDIRECT(AS40),\"\"),\"\")","v":{"$error":"#N/A"}},{"$f":"IF(COLUMN()>=INDIRECT(AQ40),IF(COLUMN()<=INDIRECT(AR40),INDIRECT(AS40),\"\"),\"\")","v":{"$error":"#N/A"}},{"$f":"IF(COLUMN()>=INDIRECT(AQ40),IF(COLUMN()<=INDIRECT(AR40),INDIRECT(AS40),\"\"),\"\")","v":{"$error":"#N/A"}},{"$f":"IF(COLUMN()>=INDIRECT(AQ40),IF(COLUMN()<=INDIRECT(AR40),INDIRECT(AS40),\"\"),\"\")","v":{"$error":"#N/A"}},{"$f":"IF(COLUMN()>=INDIRECT(AQ40),IF(COLUMN()<=INDIRECT(AR40),INDIRECT(AS40),\"\"),\"\")","v":{"$error":"#N/A"}},{"$f":"IF(COLUMN()>=INDIRECT(AQ40),IF(COLUMN()<=INDIRECT(AR40),INDIRECT(AS40),\"\"),\"\")","v":{"$error":"#N/A"}},{"$f":"IF(COLUMN()>=INDIRECT(AQ40),IF(COLUMN()<=INDIRECT(AR40),INDIRECT(AS40),\"\"),\"\")","v":{"$error":"#N/A"}},{"$f":"IF(COLUMN()>=INDIRECT(AQ40),IF(COLUMN()<=INDIRECT(AR40),INDIRECT(AS40),\"\"),\"\")","v":{"$error":"#N/A"}},{"$f":"IF(COLUMN()>=INDIRECT(AQ40),IF(COLUMN()<=INDIRECT(AR40),INDIRECT(AS40),\"\"),\"\")","v":{"$error":"#N/A"}},{"$f":"IF(COLUMN()>=INDIRECT(AQ40),IF(COLUMN()<=INDIRECT(AR40),INDIRECT(AS40),\"\"),\"\")","v":{"$error":"#N/A"}},{"$f":"IF(COLUMN()>=INDIRECT(AQ40),IF(COLUMN()<=INDIRECT(AR40),INDIRECT(AS40),\"\"),\"\")","v":{"$error":"#N/A"}},{"$f":"IF(COLUMN()>=INDIRECT(AQ40),IF(COLUMN()<=INDIRECT(AR40),INDIRECT(AS40),\"\"),\"\")","v":{"$error":"#N/A"}},{"$f":"IF(COLUMN()>=INDIRECT(AQ40),IF(COLUMN()<=INDIRECT(AR40),INDIRECT(AS40),\"\"),\"\")","v":{"$error":"#N/A"}},{"$f":"IF(COLUMN()>=INDIRECT(AQ40),IF(COLUMN()<=INDIRECT(AR40),INDIRECT(AS40),\"\"),\"\")","v":{"$error":"#N/A"}},{"$f":"IF(COLUMN()>=INDIRECT(AQ40),IF(COLUMN()<=INDIRECT(AR40),INDIRECT(AS40),\"\"),\"\")","v":{"$error":"#N/A"}},{"$f":"IF(COLUMN()>=INDIRECT(AQ40),IF(COLUMN()<=INDIRECT(AR40),INDIRECT(AS40),\"\"),\"\")","v":{"$error":"#N/A"}},{"$f":"IF(COLUMN()>=INDIRECT(AQ40),IF(COLUMN()<=INDIRECT(AR40),INDIRECT(AS40),\"\"),\"\")","v":{"$error":"#N/A"}},{"$f":"IF(COLUMN()>=INDIRECT(AQ40),IF(COLUMN()<=INDIRECT(AR40),INDIRECT(AS40),\"\"),\"\")","v":{"$error":"#N/A"}},null,{"$f":"CONCATENATE(\"'\",SUBSTITUTE(SUBSTITUTE(SUBSTITUTE(MID(CELL(\"direccion\",'ETAPA III.a'!M$1),FIND(\"]\",CELL(\"direccion\",'ETAPA III.a'!M$1))+1,LEN(CELL(\"direccion\",'ETAPA III.a'!M$1))),\"$\",\"\"),1,MATCH($A40,'ETAPA III.a'!$K:$K,0)),\"!\",\"!$\"))","v":"'ETAPA III.a'!$M221"},{"$f":"CONCATENATE(\"'\",SUBSTITUTE(SUBSTITUTE(SUBSTITUTE(MID(CELL(\"direccion\",'ETAPA III.a'!N$1),FIND(\"]\",CELL(\"direccion\",'ETAPA III.a'!N$1))+1,LEN(CELL(\"direccion\",'ETAPA III.a'!N$1))),\"$\",\"\"),1,MATCH($A40,'ETAPA III.a'!$K:$K,0)),\"!\",\"!$\"))","v":"'ETAPA III.a'!$N221"},{"$f":"CONCATENATE(\"'\",SUBSTITUTE(SUBSTITUTE(SUBSTITUTE(MID(CELL(\"direccion\",'ETAPA III.a'!L$1),FIND(\"]\",CELL(\"direccion\",'ETAPA III.a'!L$1))+1,LEN(CELL(\"direccion\",'ETAPA III.a'!L$1))),\"$\",\"\"),1,MATCH($A40,'ETAPA III.a'!$K:$K,0)),\"!\",\"!$\"))","v":"'ETAPA III.a'!$L221"}]

{"sheet":"ETAPA III.cde","index":11,"n_rows":110,"n_cols":8,"rows_kept":110,"cut":false,"hidden":false,"merged":[[110,0,130,7],[106,0,106,7],[107,0,107,7],[2,3,2,7],[7,0,8,4],[9,0,10,4],[79,3,79,7],[82,0,102,7]]}
[null,null,null,null,null,null,null,{"$f":"TABLAS!$AL$2","v":"FITXES PER A L'ELABORACIÓ D'UNA ESTRATÈGIA LOCAL DE REHABILITACIÓ DE L'ENTORN CONSTRUÏT"}]
[null,null,null,null,null,null,null,{"$f":"TABLAS!$AL$6","v":"ETAPA III: PROGRAMA D'ACTUACIONS"}]
[null,null,null,{"$f":"TABLAS!$AL$4","v":""}]
["III.c  Abast de les accions"]
[]
["Es preveu ampliar el parc d'habitatge social o d'habitatge en lloguer a preus assequibles?"]
[]
["Es preveu integrar noves maneres d'habitar com l'habitatge col·laboratiu, cooperatiu, destinat a majors, joves o altres col·lectius?"]
[]
["Es preveu afavorir la cohesió i l'intercanvi generacional (exemples: convivència de joves i majors), social i cultural en el barri/àmbit d'actuació?"]
[]
["Es contribueix a erradicar situacions d'infrahabitatge?"]
[]
["Es preveu recuperar espais o edificis obsolets o en desús per a destinar-los a habitatge?"]
[]
["Es preveu rehabilitar edificis de manera que s'afecte els espais comuns dels edificis d'ús residencial?"]
[]
["Superfície construïda total dels edificis residencials sobre la qual es preveu intervindre (m2)"]
["Objecte de les accions de rehabilitació:"]
[null,null,"Edificis en ús"]
[]
[null,null,"Edificis en desús"]
[]
[null,null,"Millora de la urbanització de l'espai públic"]
[]
["Tipus d'actuacions de rehabilitació:"]
[null,null,"Rehabilitació estructural"]
[]
[null,null,"Rehabilitació de façanes, cobertes o mitgeres o altres elements constructius"]
[]
[null,null,"Millora de la Instal·lació de sanejament i/o de subministrament d'aigua i/o d'electricitat"]
[]
[null,null,"Millorar-hi l’accessibilitat."]
[]
[null,null,"Incorporació o millora d'energies renovables en les instal·lacions tèrmiques"]
[]
[null,null,"Generació d'energia elèctrica mitjançant fonts renovables"]
[]
[null,null,"Infraestructures associades a la mobilitat elèctrica"]
[]
[null,null,"Actuacions de digitalització"]
[]
[null,null,"Retirada de l'amiant"]
[]
[null,null,"Millora en la gestió de residus"]
[]
[null,null,"Altres"]
[]
["Les actuacions previstes impliquen la demolició d'edificacions existents? "]
[]
[null,null,"Superfície demolida (m²)",null,"Percentatge de demolició respecte al total de l'actuació"]
[]
["Les actuacions previstes impliquen la construcció de noves edificacions?"]
[]
[null,null,"Superfície demolida (m²)",null,"Percentatge de demolició respecte al total de l'actuació"]
[]
["Tipus d'actuacions de transformació integral per a l'adaptació i mitigació del canvi climàtic de l'entorn urbà:"]
[null,null,"Renovació i digitalització de l'enllumenat públic"]
[]
[null,null,"Conversió en zona de vianants i eixamplament de carrers per a l'ús per als vianants"]
[]
[null,null,"Disseny de microespais de biodiversitat"]
[]
[null,null,"Infraestructures de mobilitat alternatives com ara carrils per a bicicletes, línies de tramvia, etc."]
[]
[null,null,"Construcció i rehabilitació de parcs"]
[]
[null,null,"Implementació de sistemes de drenatge sostenible"]
[]
[null,null,"Instal·lacions energètiques d'àmbit superior a l'edifici (district heating…)."]
[]
[null,null,"Altres"]
[]
["Quina es preveu que siga la qualificació energètica majoritària resultant en els edificis objecte de la rehabilitació sostenible? "]
[]
["Es preveu algun reallotjament temporal dels habitants dels habitatges afectats?"]
[]
[null,null,null,null,null,null,null,{"$f":"TABLAS!$AL$2","v":"FITXES PER A L'ELABORACIÓ D'UNA ESTRATÈGIA LOCAL DE REHABILITACIÓ DE L'ENTORN CONSTRUÏT"}]
[null,null,null,null,null,null,null,{"$f":"TABLAS!$AL$6","v":"ETAPA III: PROGRAMA D'ACTUACIONS"}]
[null,null,null,{"$f":"TABLAS!$AL$4","v":""}]
["III.d  Observacions"]
[]
[]
[]
[]
[]
[]
[]
[]
[]
[]
[]
[]
[]
[]
[]
[]
[]
[]
[]
[]
[]
[]
[]
["III.e  Conclusions extretes del procés participatiu"]
[]
["S'ha aconseguit un elevat grau de consens amb les diferents administracions actuants, així com amb els sectors involucrats de la societat civil (associacions veïnals i ciutadanes, banca, empreses del sector, etc.) per al desenvolupament de les actuacions?"]
[]
[]
["Conclusions:"]

{"sheet":"ETAPA IV","index":12,"n_rows":157,"n_cols":12,"rows_kept":157,"cut":false,"hidden":false,"merged":[[8,6,8,7],[8,8,8,11],[10,6,10,7],[10,8,10,11],[12,6,12,7],[12,8,12,11],[14,6,14,7],[14,8,14,11],[16,6,16,7],[16,8,16,11],[2,5,2,11],[4,0,5,2],[4,3,5,3],[4,4,5,4],[4,5,5,5],[4,6,5,7],[4,8,5,11],[6,6,6,7],[6,8,6,11],[77,2,77,3],[78,2,78,3],[79,2,79,3],[80,2,80,3],[18,6,18,7],[74,0,76,3],[74,5,74,11],[75,5,75,7],[75,8,75,10],[75,11,76,11],[18,8,18,11],[71,5,71,11],[74,4,76,4],[76,6,76,7],[65,0,68,11],[37,0,40,11],[22,0,23,10],[34,6,35,11],[20,6,20,7],[20,8,20,11],[81,6,81,7],[82,6,82,7],[83,6,83,7],[77,6,77,7],[78,6,78,7],[79,6,79,7],[80,6,80,7],[87,6,87,7],[88,6,88,7],[89,6,89,7],[84,6,84,7],[85,6,85,7],[86,6,86,7],[93,6,93,7],[94,6,94,7],[95,6,95,7],[90,6,90,7],[91,6,91,7],[92,6,92,7],[81,2,81,3],[82,2,82,3],[83,2,83,3],[84,2,84,3],[85,2,85,3],[95,2,95,3],[86,2,86,3],[87,2,87,3],[88,2,88,3],[89,2,89,3],[90,2,90,3],[91,2,91,3],[92,2,92,3],[93,2,93,3],[94,2,94,3],[159,0,178,11],[109,0,122,11],[125,5,125,11],[131,0,132,11],[103,2,103,3],[104,2,104,3],[105,2,105,3],[106,2,106,3],[105,6,105,7],[106,6,106,7],[103,6,103,7],[104,6,104,7],[102,2,102,3],[156,0,158,11],[133,0,152,11],[102,6,102,7],[96,2,96,3],[97,2,97,3],[98,2,98,3],[99,2,99,3],[100,2,100,3],[99,6,99,7],[100,6,100,7],[101,6,101,7],[96,6,96,7],[97,6,97,7],[98,6,98,7],[101,2,101,3]]}
[null,null,null,null,null,null,null,null,null,null,null,{"$f":"TABLAS!$AL$2","v":"FITXES PER A L'ELABORACIÓ D'UNA ESTRATÈGIA LOCAL DE REHABILITACIÓ DE L'ENTORN CONSTRUÏT"}]
[null,null,null,null,null,null,null,null,null,null,null,{"$f":"TABLAS!$AL$7","v":"ETAPA IV: IMPLEMENTACIÓ"}]
[null,null,null,null,null,{"$f":"TABLAS!$AL$4","v":""}]
["IV.a   Planejament afectat per l'estratègia"]
["Instrument",null,null,"Vigent","Data d'aprovació","En desenvolupament","Data prevista d'aprovació",null,"Observacions"]
[]
[null,null,"Pla general  "]
[]
[null,null,"Normes subsidiàries"]
[]
[null,null,"Pla parcial"]
[]
[null,null,"Pla especial"]
[]
[null,null,"Estudi de detall"]
[]
[null,null,"Pla de reforma interior"]
[]
[null,null,"PRI segons art. 72 LOTUP"]
[]
[null,null,"Altres"]
[]
["S'han establit fórmules o mecanismes per a assegurar l'aplicació en termini de les actuacions previstes, agilitant els tràmits administratius necessaris per al desenvolupament de l'actuació?"]
[]
["En cas afirmatiu, especifiqueu-ne quines:"]
[]
[null,null,"Planejament",null,null,null,null,"Llicències d'intervenció"]
[]
[null,null,"Comunicacions prèvies",null,null,null,null,"Creació d'oficines municipals d'habitatge i regeneració"]
[]
[null,null,"Declaracions responsables",null,null,null,null,"Xarxa XALOC"]
[]
[null,null,"Llicències d'obra",null,null,null,null,"Altres (descriure breument)"]
[]
[]
[]
["Observacions:"]
[]
[]
[]
[]
[]
["IV.b   Agents implicats en l'estratègia"]
[]
[null,null,"Administració general de l'Estat",null,null,null,null,"Diputació"]
[]
["Generalitat",null,null,null,null,null,"Ajuntament"]
[]
[null,null,"Conselleria amb competència en habitatge",null,null,null,null,"Regidoria d'Habitatge"]
[]
[null,null,"Conselleria amb competència en urbanisme o obres públiques",null,null,null,null,"Regidoria Urbanisme"]
[]
[null,null,"Una altra conselleria",null,null,null,null,"Regidoria Social"]
[]
[null,null,null,null,null,null,null,"Altres regidories"]
[]
["Societat civil",null,null,null,null,null,"Sector privat"]
[]
[null,null,"Associació de veïns",null,null,null,null,"Comunitats de veïns"]
[]
[null,null,"Associació de comerciants",null,null,null,null,"Empresa privada o empreses privades"]
[]
[null,null,"Altres",null,null,null,null,"Altres"]
[]
["Observacions:"]
[]
[]
[]
[]
[null,null,null,null,null,null,null,null,null,null,null,{"$f":"TABLAS!$AL$2","v":"FITXES PER A L'ELABORACIÓ D'UNA ESTRATÈGIA LOCAL DE REHABILITACIÓ DE L'ENTORN CONSTRUÏT"}]
[null,null,null,null,null,null,null,null,null,null,null,{"$f":"IF($L$2=\"\",\"\",$L$2)","v":"ETAPA IV: IMPLEMENTACIÓ"}]
[null,null,null,null,null,{"$f":"TABLAS!$AL$4","v":""}]
["IV.c  Accions, tipus de contracte i temps de tramitació"]
[]
["Acció",null,null,null,"Pressupost","Temps orientatiu de tramitació (mesos)"]
[null,null,null,null,null,"Projecte",null,null,"Execució obra",null,null,"Total"]
[null,null,null,null,null,"Contractació","Redacció",null,"Supervisió","Contractació","Execució"]
["A.1",null,{"$f":"INDIRECT(CONCATENATE(\"'ETAPA III.a'!B\",MATCH(VALUE(SUBSTITUTE(A78,\"A.\",\"\")),'ETAPA III.a'!K:K,0)))","v":0},null,{"$f":"INDIRECT(CONCATENATE(\"'ETAPA III.a'!G\",MATCH(VALUE(SUBSTITUTE(A78,\"A.\",\"\")),'ETAPA III.a'!K:K,0)))","v":0},null,null,null,null,null,null,{"$f":"SUM(F78:K78)","v":0}]
["A.2",null,{"$f":"INDIRECT(CONCATENATE(\"'ETAPA III.a'!B\",MATCH(VALUE(SUBSTITUTE(A79,\"A.\",\"\")),'ETAPA III.a'!K:K,0)))","v":0},null,{"$f":"INDIRECT(CONCATENATE(\"'ETAPA III.a'!G\",MATCH(VALUE(SUBSTITUTE(A79,\"A.\",\"\")),'ETAPA III.a'!K:K,0)))","v":0},null,null,null,null,null,null,{"$f":"SUM(F79:K79)","v":0}]
["A.3",null,{"$f":"INDIRECT(CONCATENATE(\"'ETAPA III.a'!B\",MATCH(VALUE(SUBSTITUTE(A80,\"A.\",\"\")),'ETAPA III.a'!K:K,0)))","v":0},null,{"$f":"INDIRECT(CONCATENATE(\"'ETAPA III.a'!G\",MATCH(VALUE(SUBSTITUTE(A80,\"A.\",\"\")),'ETAPA III.a'!K:K,0)))","v":0},null,null,null,null,null,null,0]
["A.4",null,{"$f":"INDIRECT(CONCATENATE(\"'ETAPA III.a'!B\",MATCH(VALUE(SUBSTITUTE(A81,\"A.\",\"\")),'ETAPA III.a'!K:K,0)))","v":0},null,{"$f":"INDIRECT(CONCATENATE(\"'ETAPA III.a'!G\",MATCH(VALUE(SUBSTITUTE(A81,\"A.\",\"\")),'ETAPA III.a'!K:K,0)))","v":0},null,null,null,null,null,null,0]
["A.5",null,{"$f":"INDIRECT(CONCATENATE(\"'ETAPA III.a'!B\",MATCH(VALUE(SUBSTITUTE(A82,\"A.\",\"\")),'ETAPA III.a'!K:K,0)))","v":0},null,{"$f":"INDIRECT(CONCATENATE(\"'ETAPA III.a'!G\",MATCH(VALUE(SUBSTITUTE(A82,\"A.\",\"\")),'ETAPA III.a'!K:K,0)))","v":0},null,null,null,null,null,null,0]
["A.6",null,{"$f":"INDIRECT(CONCATENATE(\"'ETAPA III.a'!B\",MATCH(VALUE(SUBSTITUTE(A83,\"A.\",\"\")),'ETAPA III.a'!K:K,0)))","v":0},null,{"$f":"INDIRECT(CONCATENATE(\"'ETAPA III.a'!G\",MATCH(VALUE(SUBSTITUTE(A83,\"A.\",\"\")),'ETAPA III.a'!K:K,0)))","v":0},null,null,null,null,null,null,0]
["A.7",null,{"$f":"INDIRECT(CONCATENATE(\"'ETAPA III.a'!B\",MATCH(VALUE(SUBSTITUTE(A84,\"A.\",\"\")),'ETAPA III.a'!K:K,0)))","v":0},null,{"$f":"INDIRECT(CONCATENATE(\"'ETAPA III.a'!G\",MATCH(VALUE(SUBSTITUTE(A84,\"A.\",\"\")),'ETAPA III.a'!K:K,0)))","v":0},null,null,null,null,null,null,0]
["A.8",null,{"$f":"INDIRECT(CONCATENATE(\"'ETAPA III.a'!B\",MATCH(VALUE(SUBSTITUTE(A85,\"A.\",\"\")),'ETAPA III.a'!K:K,0)))","v":0},null,{"$f":"INDIRECT(CONCATENATE(\"'ETAPA III.a'!G\",MATCH(VALUE(SUBSTITUTE(A85,\"A.\",\"\")),'ETAPA III.a'!K:K,0)))","v":0},null,null,null,null,null,null,0]
["A.9",null,{"$f":"INDIRECT(CONCATENATE(\"'ETAPA III.a'!B\",MATCH(VALUE(SUBSTITUTE(A86,\"A.\",\"\")),'ETAPA III.a'!K:K,0)))","v":0},null,{"$f":"INDIRECT(CONCATENATE(\"'ETAPA III.a'!G\",MATCH(VALUE(SUBSTITUTE(A86,\"A.\",\"\")),'ETAPA III.a'!K:K,0)))","v":0},null,null,null,null,null,null,0]
["A.10",null,{"$f":"INDIRECT(CONCATENATE(\"'ETAPA III.a'!B\",MATCH(VALUE(SUBSTITUTE(A87,\"A.\",\"\")),'ETAPA III.a'!K:K,0)))","v":0},null,{"$f":"INDIRECT(CONCATENATE(\"'ETAPA III.a'!G\",MATCH(VALUE(SUBSTITUTE(A87,\"A.\",\"\")),'ETAPA III.a'!K:K,0)))","v":0},null,null,null,null,null,null,0]
["A.11",null,{"$f":"INDIRECT(CONCATENATE(\"'ETAPA III.a'!B\",MATCH(VALUE(SUBSTITUTE(A88,\"A.\",\"\")),'ETAPA III.a'!K:K,0)))","v":0},null,{"$f":"INDIRECT(CONCATENATE(\"'ETAPA III.a'!G\",MATCH(VALUE(SUBSTITUTE(A88,\"A.\",\"\")),'ETAPA III.a'!K:K,0)))","v":0},null,null,null,null,null,null,0]
["A.12",null,{"$f":"INDIRECT(CONCATENATE(\"'ETAPA III.a'!B\",MATCH(VALUE(SUBSTITUTE(A89,\"A.\",\"\")),'ETAPA III.a'!K:K,0)))","v":0},null,{"$f":"INDIRECT(CONCATENATE(\"'ETAPA III.a'!G\",MATCH(VALUE(SUBSTITUTE(A89,\"A.\",\"\")),'ETAPA III.a'!K:K,0)))","v":0},null,null,null,null,null,null,0]
["A.13",null,{"$f":"INDIRECT(CONCATENATE(\"'ETAPA III.a'!B\",MATCH(VALUE(SUBSTITUTE(A90,\"A.\",\"\")),'ETAPA III.a'!K:K,0)))","v":0},null,{"$f":"INDIRECT(CONCATENATE(\"'ETAPA III.a'!G\",MATCH(VALUE(SUBSTITUTE(A90,\"A.\",\"\")),'ETAPA III.a'!K:K,0)))","v":0},null,null,null,null,null,null,0]
["A.14",null,{"$f":"INDIRECT(CONCATENATE(\"'ETAPA III.a'!B\",MATCH(VALUE(SUBSTITUTE(A91,\"A.\",\"\")),'ETAPA III.a'!K:K,0)))","v":0},null,{"$f":"INDIRECT(CONCATENATE(\"'ETAPA III.a'!G\",MATCH(VALUE(SUBSTITUTE(A91,\"A.\",\"\")),'ETAPA III.a'!K:K,0)))","v":0},null,null,null,null,null,null,0]
["A.15",null,{"$f":"INDIRECT(CONCATENATE(\"'ETAPA III.a'!B\",MATCH(VALUE(SUBSTITUTE(A92,\"A.\",\"\")),'ETAPA III.a'!K:K,0)))","v":0},null,{"$f":"INDIRECT(CONCATENATE(\"'ETAPA III.a'!G\",MATCH(VALUE(SUBSTITUTE(A92,\"A.\",\"\")),'ETAPA III.a'!K:K,0)))","v":0},null,null,null,null,null,null,0]
["A.16",null,{"$f":"INDIRECT(CONCATENATE(\"'ETAPA III.a'!B\",MATCH(VALUE(SUBSTITUTE(A93,\"A.\",\"\")),'ETAPA III.a'!K:K,0)))","v":0},null,{"$f":"INDIRECT(CONCATENATE(\"'ETAPA III.a'!G\",MATCH(VALUE(SUBSTITUTE(A93,\"A.\",\"\")),'ETAPA III.a'!K:K,0)))","v":0},null,null,null,null,null,null,0]
["A.17",null,{"$f":"INDIRECT(CONCATENATE(\"'ETAPA III.a'!B\",MATCH(VALUE(SUBSTITUTE(A94,\"A.\",\"\")),'ETAPA III.a'!K:K,0)))","v":0},null,{"$f":"INDIRECT(CONCATENATE(\"'ETAPA III.a'!G\",MATCH(VALUE(SUBSTITUTE(A94,\"A.\",\"\")),'ETAPA III.a'!K:K,0)))","v":0},null,null,null,null,null,null,0]
["A.18",null,{"$f":"INDIRECT(CONCATENATE(\"'ETAPA III.a'!B\",MATCH(VALUE(SUBSTITUTE(A95,\"A.\",\"\")),'ETAPA III.a'!K:K,0)))","v":0},null,{"$f":"INDIRECT(CONCATENATE(\"'ETAPA III.a'!G\",MATCH(VALUE(SUBSTITUTE(A95,\"A.\",\"\")),'ETAPA III.a'!K:K,0)))","v":0},null,null,null,null,null,null,0]
["A.19",null,{"$f":"INDIRECT(CONCATENATE(\"'ETAPA III.a'!B\",MATCH(VALUE(SUBSTITUTE(A96,\"A.\",\"\")),'ETAPA III.a'!K:K,0)))","v":0},null,{"$f":"INDIRECT(CONCATENATE(\"'ETAPA III.a'!G\",MATCH(VALUE(SUBSTITUTE(A96,\"A.\",\"\")),'ETAPA III.a'!K:K,0)))","v":0},null,null,null,null,null,null,0]
["A.20",null,{"$f":"INDIRECT(CONCATENATE(\"'ETAPA III.a'!B\",MATCH(VALUE(SUBSTITUTE(A97,\"A.\",\"\")),'ETAPA III.a'!K:K,0)))","v":0},null,{"$f":"INDIRECT(CONCATENATE(\"'ETAPA III.a'!G\",MATCH(VALUE(SUBSTITUTE(A97,\"A.\",\"\")),'ETAPA III.a'!K:K,0)))","v":0},null,null,null,null,null,null,0]
["A.21",null,{"$f":"INDIRECT(CONCATENATE(\"'ETAPA III.a'!B\",MATCH(VALUE(SUBSTITUTE(A98,\"A.\",\"\")),'ETAPA III.a'!K:K,0)))","v":0},null,{"$f":"INDIRECT(CONCATENATE(\"'ETAPA III.a'!G\",MATCH(VALUE(SUBSTITUTE(A98,\"A.\",\"\")),'ETAPA III.a'!K:K,0)))","v":0},null,null,null,null,null,null,0]
["A.22",null,{"$f":"INDIRECT(CONCATENATE(\"'ETAPA III.a'!B\",MATCH(VALUE(SUBSTITUTE(A99,\"A.\",\"\")),'ETAPA III.a'!K:K,0)))","v":0},null,{"$f":"INDIRECT(CONCATENATE(\"'ETAPA III.a'!G\",MATCH(VALUE(SUBSTITUTE(A99,\"A.\",\"\")),'ETAPA III.a'!K:K,0)))","v":0},null,null,null,null,null,null,0]
["A.23",null,{"$f":"INDIRECT(CONCATENATE(\"'ETAPA III.a'!B\",MATCH(VALUE(SUBSTITUTE(A100,\"A.\",\"\")),'ETAPA III.a'!K:K,0)))","v":0},null,{"$f":"INDIRECT(CONCATENATE(\"'ETAPA III.a'!G\",MATCH(VALUE(SUBSTITUTE(A100,\"A.\",\"\")),'ETAPA III.a'!K:K,0)))","v":0},null,null,null,null,null,null,0]
["A.24",null,{"$f":"INDIRECT(CONCATENATE(\"'ETAPA III.a'!B\",MATCH(VALUE(SUBSTITUTE(A101,\"A.\",\"\")),'ETAPA III.a'!K:K,0)))","v":0},null,{"$f":"INDIRECT(CONCATENATE(\"'ETAPA III.a'!G\",MATCH(VALUE(SUBSTITUTE(A101,\"A.\",\"\")),'ETAPA III.a'!K:K,0)))","v":0},null,null,null,null,null,null,0]
["A.25",null,{"$f":"INDIRECT(CONCATENATE(\"'ETAPA III.a'!B\",MATCH(VALUE(SUBSTITUTE(A102,\"A.\",\"\")),'ETAPA III.a'!K:K,0)))","v":0},null,{"$f":"INDIRECT(CONCATENATE(\"'ETAPA III.a'!G\",MATCH(VALUE(SUBSTITUTE(A102,\"A.\",\"\")),'ETAPA III.a'!K:K,0)))","v":0},null,null,null,null,null,null,0]
["A.26",null,{"$f":"INDIRECT(CONCATENATE(\"'ETAPA III.a'!B\",MATCH(VALUE(SUBSTITUTE(A103,\"A.\",\"\")),'ETAPA III.a'!K:K,0)))","v":0},null,{"$f":"INDIRECT(CONCATENATE(\"'ETAPA III.a'!G\",MATCH(VALUE(SUBSTITUTE(A103,\"A.\",\"\")),'ETAPA III.a'!K:K,0)))","v":0},null,null,null,null,null,null,0]
["A.27",null,{"$f":"INDIRECT(CONCATENATE(\"'ETAPA III.a'!B\",MATCH(VALUE(SUBSTITUTE(A104,\"A.\",\"\")),'ETAPA III.a'!K:K,0)))","v":0},null,{"$f":"INDIRECT(CONCATENATE(\"'ETAPA III.a'!G\",MATCH(VALUE(SUBSTITUTE(A104,\"A.\",\"\")),'ETAPA III.a'!K:K,0)))","v":0},null,null,null,null,null,null,0]
["A.28",null,{"$f":"INDIRECT(CONCATENATE(\"'ETAPA III.a'!B\",MATCH(VALUE(SUBSTITUTE(A105,\"A.\",\"\")),'ETAPA III.a'!K:K,0)))","v":0},null,{"$f":"INDIRECT(CONCATENATE(\"'ETAPA III.a'!G\",MATCH(VALUE(SUBSTITUTE(A105,\"A.\",\"\")),'ETAPA III.a'!K:K,0)))","v":0},null,null,null,null,null,null,0]
["A.29",null,{"$f":"INDIRECT(CONCATENATE(\"'ETAPA III.a'!B\",MATCH(VALUE(SUBSTITUTE(A106,\"A.\",\"\")),'ETAPA III.a'!K:K,0)))","v":0},null,{"$f":"INDIRECT(CONCATENATE(\"'ETAPA III.a'!G\",MATCH(VALUE(SUBSTITUTE(A106,\"A.\",\"\")),'ETAPA III.a'!K:K,0)))","v":0},null,null,null,null,null,null,0]
["A.30",null,{"$f":"INDIRECT(CONCATENATE(\"'ETAPA III.a'!B\",MATCH(VALUE(SUBSTITUTE(A107,\"A.\",\"\")),'ETAPA III.a'!K:K,0)))","v":0},null,{"$f":"INDIRECT(CONCATENATE(\"'ETAPA III.a'!G\",MATCH(VALUE(SUBSTITUTE(A107,\"A.\",\"\")),'ETAPA III.a'!K:K,0)))","v":0},null,null,null,null,null,null,0]
[]
["Observacions:"]
[]
[]
[]
[]
[]
[]
[]
[]
[]
[]
[]
[]
[]
[]
[null,null,null,null,null,null,null,null,null,null,null,{"$f":"TABLAS!$AL$2","v":"FITXES PER A L'ELABORACIÓ D'UNA ESTRATÈGIA LOCAL DE REHABILITACIÓ DE L'ENTORN CONSTRUÏT"}]
[null,null,null,null,null,null,null,null,null,null,null,{"$f":"IF($L$2=\"\",\"\",$L$2)","v":"ETAPA IV: IMPLEMENTACIÓ"}]
[null,null,null,null,null,{"$f":"TABLAS!$AL$4","v":""}]
[]
["IV.d   Seguiment i control"]
[]
["A. Comité de seguiment i avaluació:"]
[]
["Especificar el grup de treball que realitzarà labors de seguiment i control d'una o diverses accions, durant l'execució i a la finalització d'aquestes. Estarà format per representants de l'ajuntament, professionals que participen en el desenvolupament de les accions i representants de la ciutadania vinculats a les accions previstes."]
[]
[]
[]
[]
[]
[]
[]
[]
[]
[]
[]
[]
[]
[]
[]
[]
[]
[]
[]
[]
[]
[]
["B. Indicadors durant l'execució i la finalització de cada acció o grup d'accions:"]
[]
["Aquests indicadors permetran analitzar l'evolució de l'execució de l'acció, mitjançant l'avaluació contínua del grau de compliment dels terminis, les previsions econòmiques, les condicions tècniques de qualitat, eficiència energètica, accessibilitat o de gènere.\nLa definició d'indicadors dependrà de la naturalesa de cada acció, de manera que, analitzats amb determinada periodicitat, permeten la detecció de possibles desviacions i per tant faciliten la presa de decisions per a aconseguir el resultat esperat."]

{"sheet":"ANNEX 1","index":13,"n_rows":261,"n_cols":25,"rows_kept":261,"cut":false,"hidden":false,"merged":[[258,8,258,24],[260,8,260,24],[246,8,246,24],[248,3,248,4],[248,8,248,24],[250,8,250,24],[254,8,254,24],[256,8,256,24],[232,5,232,24],[233,5,233,24],[235,0,235,24],[237,19,237,24],[242,3,242,5],[242,8,242,24],[218,0,218,24],[220,19,220,24],[224,5,224,24],[227,5,227,24],[229,5,229,24],[230,5,230,24],[198,1,206,4],[198,11,206,14],[198,16,206,19],[208,1,216,4],[208,11,216,14],[208,16,216,19],[226,5,226,24],[223,5,223,24],[178,1,186,4],[178,11,186,14],[178,16,186,19],[188,1,196,4],[188,11,196,14],[188,16,196,19],[171,0,171,24],[173,19,173,24],[176,1,176,4],[176,6,176,9],[176,11,176,14],[176,16,176,19],[176,21,176,24],[145,11,145,14],[145,16,145,24],[147,3,148,9],[148,12,169,14],[164,18,169,24],[169,3,169,9],[136,3,138,4],[136,6,138,14],[136,19,138,19],[138,23,138,24],[140,0,140,24],[142,19,142,24],[120,3,122,4],[120,6,122,14],[124,3,126,4],[124,6,126,14],[128,6,130,14],[132,6,134,14],[99,9,100,24],[102,9,103,24],[105,9,111,24],[117,0,117,14],[117,16,118,19],[117,21,118,24],[118,0,118,4],[118,6,118,14],[83,1,90,9],[86,18,90,24],[90,13,90,14],[92,0,92,24],[94,19,94,24],[97,0,97,8],[97,9,97,24],[62,5,63,24],[65,5,66,24],[68,5,69,24],[71,5,72,24],[81,1,81,9],[81,19,81,24],[46,1,46,24],[48,19,48,24],[51,5,51,24],[53,5,54,24],[56,5,57,24],[59,5,60,24],[29,11,32,14],[34,11,37,14],[35,18,36,19],[35,23,38,24],[38,18,39,19],[42,18,44,19],[19,8,21,9],[19,11,22,14],[19,23,20,24],[22,24,23,24],[24,8,26,9],[24,11,27,14],[25,23,26,24],[0,0,0,24],[2,10,2,14],[2,19,2,24],[16,1,17,4],[16,6,16,14],[16,16,17,19],[16,21,17,24],[17,6,17,9],[17,11,17,14]]}
[{"$f":"TABLAS!$AL$2","v":"FITXES PER A L'ELABORACIÓ D'UNA ESTRATÈGIA LOCAL DE REHABILITACIÓ DE L'ENTORN CONSTRUÏT"}]
[null,null,null,null,null,null,null,null,null,null,null,null,null,null,null,null,null,null,null,null,null,null,null,null,{"$f":"TABLAS!$AL$8","v":"ANNEX 1: PARTICIPACIÓ I GOVERNANÇA"}]
[null,null,null,null,null,null,null,null,null,null,null,null,null,null,null,null,null,null,null,{"$f":"TABLAS!$AL$4","v":""}]
["A. Participació durant la redacció de l'estratègia"]
[]
[null,null,null,"No s'ha realitzat participació ciutadana per a la planificació estratègica (si és el cas, no cal emplenar aquest annex)"]
[]
[null,null,null,"Sí que s'ha realitzat participació ciutadana per a la planificació estratègica"]
[]
[null,null,null,null,null,null,null,null,"Participació específica per a la redacció de l'\"Estratègia municipal de rehabilitació i regeneració de l'hàbitat construït\""]
[]
[null,null,null,null,null,null,null,null,"Participació per a altres estratègies. Si el seu municipi ja va realitzar participació ciutadana per a la definició d'una estratègia municipal prèvia "]
[null,null,null,null,null,null,null,null,"(EDUSI, ARRU, PUAM o similar), empleneu aquest bloc en funció de la participació implementada"]
[]
["A1. A 1.Participació ciutadana i d'agents socials durant la redacció de l’estratègia"]
[]
[null," Nivell de participació assolit\n(vegeu llegenda 1)",null,null,null,null,"Agents que han participat",null,null,null,null,null,null,null,null,null,"Tècniques i eines de participació utilitzades per a la redacció de l'estratègia",null,null,null,null,"Espais i òrgans de participació utilitzats (permanents al llarg del procés) (vegeu llegenda 2)"]
[null,null,null,null,null,null,"Grup",null,null,null,null,"Nom del col·lectiu o entitat (si han participat persones a títol personal, només indiqueu nre. aproximat, no dades personals)"]
[]
[null,null,null,"1. Informar",null,null,null,null,"Agents ciutadans (individualment o mitjançant col·lectius i entitats, tercer sector, etc.)",null,null,null,null,null,null,null,null,null," Enquestes i consultes ciutadanes",null,null,null,null,"A. Grups existents, no generats específicament per a l'estratègia"]
[]
[null,null,null,"2. Consultar",null,null,null,null,null,null,null,null,null,null,null,null,null,null,"Exposicions interactives"]
[null,null,null,null,null,null,null,null,null,null,null,null,null,null,null,null,null,null,null,null,null,null,null,null," A1. Consells municipals o\n ciutadans"]
[null,null,null,"3. Implicar",null,null,null,null,null,null,null,null,null,null,null,null,null,null,"Jornades (presencials i en línia)"]
[null,null,null,null,null,null,null,null,"Equipaments públics (biblioteca; centre de salut; centres escolars i formatius, culturals, esportius, etc.)"]
[null,null,null,"4. Col·laborar",null,null,null,null,null,null,null,null,null,null,null,null,null,null,"Debats, col·loquis, fòrums",null,null,null,null,"B. Grups generats específicament per a l'estratègia"]
[]
[null,null,null,null,null,null,null,null,null,null,null,null,null,null,null,null,null,null,"Tallers"]
[null,null,null,null,null,null,null,null,null,null,null,null,null,null,null,null,null,null,null,null,null,null,null,null," B1. Grup motor"]
[null,null,null,null,null,null,null,null,"Sector privat",null,null,null,null,null,null,null,null,null,"Entrevistes (individuals o grupals)"]
[null,null,null,null,null,null,null,null,null,null,null,null,null,null,null,null,null,null,null,null,null,null,null,null," B2. Grups o comissions de treball"]
[null,null,null,null,null,null,null,null,null,null,null,null,null,null,null,null,null,null,"Assemblees ciutadanes"]
[null,null,null,null,null,null,null,null,null,null,null,null,null,null,null,null,null,null,null,null,null,null,null,null,"B3. Comissió de seguiment"]
[null,null,null,null,null,null,null,null,null,null,null,null,null,null,null,null,null,null,"Dinàmiques de grup:"]
[null,null,null,null,null,null,null,null,"Sector investigador o acadèmic",null,null,null,null,null,null,null,null,null,null,null,null,null,null,"Altres. Especifiqueu-ne quins:"]
[null,null,null,null,null,null,null,null,null,null,null,null,null,null,null,null,null,null,"Urbanisme tàctic, accions en l'espai públic"]
[]
[]
[null,null,null,null,null,null,null,null,null,null,null,null,null,null,null,null,null,null,"Mapatges col·lectius, derives, passejos de Jane"]
[]
[]
[null,null,null,null,null,null,null,null,null,null,null,null,null,null,null,null,null,null,"Altres. Especifiqueu-ne quins:"]
[]
[]
[]
[]
[null,{"$f":"TABLAS!$AL$2","v":"FITXES PER A L'ELABORACIÓ D'UNA ESTRATÈGIA LOCAL DE REHABILITACIÓ DE L'ENTORN CONSTRUÏT"}]
[null,null,null,null,null,null,null,null,null,null,null,null,null,null,null,null,null,null,null,null,null,null,null,null,{"$f":"IF($Y$2=\"\",\"\",$Y$2)","v":"ANNEX 1: PARTICIPACIÓ I GOVERNANÇA"}]
[null,null,null,null,null,null,null,null,null,null,null,null,null,null,null,null,null,null,null,{"$f":"TABLAS!$AL$4","v":""}]
[null,null,null,null,"Participació específica per a la plena inclusió (enfocament de gènere implicació de col·lectius vulnerabilitzats, etc.)"]
[]
[null,null,null,null,"Grup","Tècniques, eines i espais que s'han utilitzat per a la inclusió de cada grup"]
[]
[null,null,null,null,"Infància"]
[]
[]
[null,null,null,null,"Joventut"]
[]
[]
[null,null,null,null,"Persones majors"]
[]
[]
[null,null,null,null,"Diversitat funcional"]
[]
[]
[null,null,null,null,"Migrants / Diversitat cultural"]
[]
[]
[null,null,null,null,"Dones"]
[]
[]
[null,null,null,null,"Altres"]
[]
[]
[]
["A2. Participació interna a l'Ajuntament durant la redacció de l'estratègia"]
[]
[null,null,null,null,"No s'ha realitzat participació interna a l'Ajuntament (si és el cas, no cal emplenar l'apartat A2)"]
[]
[null,null,null,null,"Sí que s'ha realitzat participació interna a l'Ajuntament"]
[]
[null,"Serveis i regidories que han participat (personal tècnic i polític)",null,null,null,null,null,null,null,null,null,null,null,null,"Tècniques i eines de participació",null,null,null,null,"S'han establit espais d'interacció entre els tècnics i la ciutadania i resta d'agents?"]
[]
[null,null,null,null,null,null,null,null,null,null,null,null,null,"Enquesta",null,null,null,null,"No"]
[]
[null,null,null,null,null,null,null,null,null,null,null,null,null,"Reunions específiques",null,null,null,null,"Sí. Especifiqueu-ne quins:"]
[]
[null,null,null,null,null,null,null,null,null,null,null,null,null,"Grups o comissions de treball"]
[]
[null,null,null,null,null,null,null,null,null,null,null,null,null,"Altres. Especifiqueu-ne quins:"]
[]
[]
[{"$f":"TABLAS!$AL$2","v":"FITXES PER A L'ELABORACIÓ D'UNA ESTRATÈGIA LOCAL DE REHABILITACIÓ DE L'ENTORN CONSTRUÏT"}]
[null,null,null,null,null,null,null,null,null,null,null,null,null,null,null,null,null,null,null,null,null,null,null,null,{"$f":"IF($Y$2=\"\",\"\",$Y$2)","v":"ANNEX 1: PARTICIPACIÓ I GOVERNANÇA"}]
[null,null,null,null,null,null,null,null,null,null,null,null,null,null,null,null,null,null,null,{"$f":"TABLAS!$AL$4","v":""}]
["A3. Aportacions de la participació ciutadana per etapes"]
[]
["En quines etapes de l'estratègia s'ha comptat amb participació ciutadana?",null,null,null,null,null,null,null,null,"Conclusions extretes de la participació en cada etapa"]
[]
[null,{"$f":"IF(J100=\"\",\"\",\"X\")","v":""},null,null,"Etapa I. Identificació de l'àmbit",null,null,null,null,{"$f":"IF('ETAPA I'!A85=\"\",\"\",'ETAPA I'!A85)","v":""}]
[]
[]
[null,{"$f":"IF(J103=\"\",\"\",\"X\")","v":""},null,null,"Etapa II. Anàlisi i diagnòstic",null,null,null,null,{"$f":"IF('ETAPA II.i'!A10=\"\",\"\",'ETAPA II.i'!A10)","v":""}]
[]
[]
[null,{"$f":"IF(J106=\"\",\"\",\"X\")","v":""},null,null,"Etapa III. Programa d’actuacions",null,null,null,null,{"$f":"IF('ETAPA III.cde'!A111=\"\",\"\",'ETAPA III.cde'!A111)","v":""}]
[]
[null,null,null,null," Objectius estratègics"]
[]
[null,null,null,null," Objectius específics"]
[]
[null,null,null,null," Línies d'actuació"]
[]
[null,"B. Participació durant la implementació de l'estratègia"]
[]
["B1. Governança, seguiment i avaluació de l'estratègia"]
[]
["Agents que s'implicaran durant la governança, seguiment i avaluació de l'estratègia",null,null,null,null,null,null,null,null,null,null,null,null,null,null,null,"Espais o òrgans de governança col·laborativa (gestió, seguiment i avaluació) (vegeu llegenda 2)",null,null,null,null,"Quines tècniques i eines s'utilitzaran específicament per a l'avaluació?"]
["Grup",null,null,null,null,null,"Nom del col·lectiu o entitat.  Si han participat persones a títol personal, només indiqueu nombre aproximat, no dades personals"]
[]
[null,null,null,"Agents ciutadans (individualment o mitjançant col·lectius, entitats, tercer sector...)",null,null,null,null,null,null,null,null,null,null,null,null,null,null,"A. Grups existents, no generats",null,null,null,null,"No es fa avaluació"]
[null,null,null,null,null,null,null,null,null,null,null,null,null,null,null,null,null,null," específicament per a l'estratègia"]
[null,null,null,null,null,null,null,null,null,null,null,null,null,null,null,null,null,null,null,null,null,null,null,"Enquestes"]
[null,null,null,null,null,null,null,null,null,null,null,null,null,null,null,null,null,null,null,"A1. Consells municipals o "]
[null,null,null,"Administració pública: serveis i equipaments públics",null,null,null,null,null,null,null,null,null,null,null,null,null,null,null,"ciutadans",null,null,null,"Rúbriques"]
[]
[null,null,null,null,null,null,null,null,null,null,null,null,null,null,null,null,null,null,"B. Grups generats ",null,null,null,null,"Taller. Jornades"]
[null,null,null,null,null,null,null,null,null,null,null,null,null,null,null,null,null,null,"específicament per a l'estratègia"]
[null,null,null,"Sector privat",null,null,null,null,null,null,null,null,null,null,null,null,null,null,null,null,null,null,null,"Anàlisi de dades"]
[null,null,null,null,null,null,null,null,null,null,null,null,null,null,null,null,null,null,null," B1. Grup motor"]
[null,null,null,null,null,null,null,null,null,null,null,null,null,null,null,null,null,null,null,null,null,null,null,"Grups de discussió específics"]
[null,null,null,null,null,null,null,null,null,null,null,null,null,null,null,null,null,null,null," B2. Grups o comissions de treball"]
[null,null,null,"Sector investigador o acadèmic",null,null,null,null,null,null,null,null,null,null,null,null,null,null,null,null,null,null,null,"Observació participant i no"]
[null,null,null,null,null,null,null,null,null,null,null,null,null,null,null,null,null,null,null," B3. Comissió de seguiment ",null,null,null,"participant"]
[]
[null,null,null,null,null,null,null,null,null,null,null,null,null,null,null,null,null,null,"Altres. Indiqueu-ne quins:",null,null,null,null,"Escolta activa xarxes socials"]
[null,null,null,"Cap. La implementació la realitzarà l'Ajuntament. "]
[null,null,null,null,null,null,null,null,null,null,null,null,null,null,null,null,null,null,null,null,null,null,null,"Altres. Indiqueu-ne quins:"]
[]
[]
[{"$f":"TABLAS!$AL$2","v":"FITXES PER A L'ELABORACIÓ D'UNA ESTRATÈGIA LOCAL DE REHABILITACIÓ DE L'ENTORN CONSTRUÏT"}]
[null,null,null,null,null,null,null,null,null,null,null,null,null,null,null,null,null,null,null,null,null,null,null,null,{"$f":"IF($Y$2=\"\",\"\",$Y$2)","v":"ANNEX 1: PARTICIPACIÓ I GOVERNANÇA"}]
[null,null,null,null,null,null,null,null,null,null,null,null,null,null,null,null,null,null,null,{"$f":"TABLAS!$AL$4","v":""}]
[null,"B2. Comunicació i difusió de l'estratègia"]
[]
[null,"Estratègia de comunicació durant la implementació de l'estratègia",null,null,null,null,null,null,null,null,null,"S'han desenvolupat activitats de conscienciació o formació específiques vinculades a l'estratègia?",null,null,null,null,"Com s'assegura la transparència? Indiqueu mecanismes i/o eines"]
[]
[null,null,null,"Espais d'informació, comunicació i difusió creats específicament per a l'estratègia",null,null,null,null,null,null,null,null,null,"Si és el cas, indiqueu-ne quins:",null,null,"Si és el cas, indiqueu-ne quins:"]
[]
[null,null,null,null,null,null,null,null,null,null,null,null,null,null,null,null,null,null,"Publicacions de resultats de la participació i del contingut de l'estratègia"]
[null,null,null,null," Correu o telèfon propi del projecte. ",null,null,null,null,null,null,null,null,null,null,null,null,null," (resultats intermedis i finals, actes activitats i òrgans de participació, "]
[null,null,null,null,null,null,null,null,null,null,null,null,null,null,null,null,null,null,"informació sobre l'estat d'implementació de cada línia estratègica i acció, etc.)"]
[null,null,null,null," Web, xarxes socials o altres mitjans telemàtics propis del projecte"]
[null,null,null,null,null,null,null,null,null,null,null,null,null,null,null,null,null,null,"Transparència economicofinancera"]
[null,null,null,null," Espai físic d'informació i difusió de l'estratègia (oficina, estand, etc.)",null,null,null,null,null,null,null,null,null,null,null,null,null,"(pressupost destinat a l'estratègia i a cadascuna de les accions)"]
[]
[null,null,null,null," Difusió en paper: Cartelleria, flyers, bustiada, altres",null,null,null,null,null,null,null,null,null,null,null,null,null,"Transparència en les contractacions, convenis i licitació d'obres"]
[null,null,null,null,null,null,null,null,null,null,null,null,null,null,null,null,null,null,"(publicació dels processos, barems, contractes, etc.)"]
[null,null,null,null," Marxandatge"]
[null,null,null,null,null,null,null,null,null,null,null,null,null,null,null,null,null,null,"Assegurar l'accés a la informació"]
[null,null,null,"Difusió en mitjans municipals (xarxes socials, bans, web municipal, fullets, etc.)",null,null,null,null,null,null,null,null,null,null,null,null,null,null,"(s'especifiquen canals i característiques de l'accés a la informació; "]
[null,null,null,null,null,null,null,null,null,null,null,null,null,null,null,null,null,null,"reclamacions i sol·licituds, etc.)"]
[null,null,null,"Difusió en mitjans de comunicació aliens (premsa, altres xarxes socials, etc.)"]
[null,null,null,null,null,null,null,null,null,null,null,null,null,null,null,null,null,null,"Altres. Especifiqueu-ne quins"]
[null,null,null,"Estratègies d'escolta activa a la població (en xarxes socials, telèfons d'atenció"]
[null,null,null,"al ciutadà, derivació des d'altres serveis de consulta ciutadana de les "]
[null,null,null,"aportacions vinculades a l'estratègia, etc.)"]
[]
[null,null,null,"Altres. Especifiqueu-ne quins:"]
[]
[]
[{"$f":"TABLAS!$AL$2","v":"FITXES PER A L'ELABORACIÓ D'UNA ESTRATÈGIA LOCAL DE REHABILITACIÓ DE L'ENTORN CONSTRUÏT"}]
[null,null,null,null,null,null,null,null,null,null,null,null,null,null,null,null,null,null,null,null,null,null,null,null,{"$f":"IF($Y$2=\"\",\"\",$Y$2)","v":"ANNEX 1: PARTICIPACIÓ I GOVERNANÇA"}]
[null,null,null,null,null,null,null,null,null,null,null,null,null,null,null,null,null,null,null,{"$f":"TABLAS!$AL$4","v":""}]
[null,null,null,"C. Participació en el desenvolupament detallat i implementació de cadascuna de les accions"]
[]
[null,"Codi i nom de l'acció",null,null,null,null,"Nivell de participació que es desitja aconseguir durant el disseny pormenortizat de cada acció (vegeu llegenda 1)",null,null,null,null,"Agents que participaran en el disseny de cada acció",null,null,null,null,"Tècniques i eines de participació previstes",null,null,null,null,"Enfocament de gestió de l'espai resultant després de l'execució (si és el cas) (posterior a l'etapa IV) (vegeu llegenda 2)"]
[]
[null,null,null,null,null,null,null,null,null," No definida",null,null,null,null,null,null,null,null,null,null,null,null,null,"A. Gestió no participada"]
[]
[null,null,null,null,null,null,null,null,null," 1. Informar",null,null,null,null,null,null,null,null,null,null,null,null,null,"B. Gestió participada"]
[]
[null,null,null,null,null,null,null,null,null," 2. Consultar",null,null,null,null,null,null,null,null,null,null,null,null,null,null," B1. Col·laboració publicoprivada"]
[]
[null,null,null,null,null,null,null,null,null," 3. Implicar",null,null,null,null,null,null,null,null,null,null,null,null,null,null," B2. Gestió cívica o ciutadana"]
[]
[null,null,null,null,null,null,null,null,null," 4. Col·laborar"]
[]
[null,null,null,null,null,null,null,null,null," No definida",null,null,null,null,null,null,null,null,null,null,null,null,null,"A. Gestió no participada"]
[]
[null,null,null,null,null,null,null,null,null," 1. Informar",null,null,null,null,null,null,null,null,null,null,null,null,null,"B. Gestió participada"]
[]
[null,null,null,null,null,null,null,null,null," 2. Consultar",null,null,null,null,null,null,null,null,null,null,null,null,null,null," B1. Col·laboració publicoprivada"]
[]
[null,null,null,null,null,null,null,null,null," 3. Implicar",null,null,null,null,null,null,null,null,null,null,null,null,null,null," B2. Gestió cívica o ciutadana"]
[]
[null,null,null,null,null,null,null,null,null," 4. Col·laborar"]
[]
[null,null,null,null,null,null,null,null,null," No definida",null,null,null,null,null,null,null,null,null,null,null,null,null,"A. Gestió no participada"]
[]
[null,null,null,null,null,null,null,null,null," 1. Informar",null,null,null,null,null,null,null,null,null,null,null,null,null,"B. Gestió participada"]
[]
[null,null,null,null,null,null,null,null,null," 2. Consultar",null,null,null,null,null,null,null,null,null,null,null,null,null,null," B1. Col·laboració publicoprivada"]
[]
[null,null,null,null,null,null,null,null,null," 3. Implicar",null,null,null,null,null,null,null,null,null,null,null,null,null,null," B2. Gestió cívica o ciutadana"]
[]
[null,null,null,null,null,null,null,null,null," 4. Col·laborar"]
[]
[null,null,null,null,null,null,null,null,null," No definida",null,null,null,null,null,null,null,null,null,null,null,null,null,"A. Gestió no participada"]
[]
[null,null,null,null,null,null,null,null,null," 1. Informar",null,null,null,null,null,null,null,null,null,null,null,null,null,"B. Gestió participada"]
[]
[null,null,null,null,null,null,null,null,null," 2. Consultar",null,null,null,null,null,null,null,null,null,null,null,null,null,null," B1. Col·laboració publicoprivada"]
[]
[null,null,null,null,null,null,null,null,null," 3. Implicar",null,null,null,null,null,null,null,null,null,null,null,null,null,null," B2. Gestió cívica o ciutadana"]
[]
[null,null,null,null,null,null,null,null,null," 4. Col·laborar"]
[]
[{"$f":"TABLAS!$AL$2","v":"FITXES PER A L'ELABORACIÓ D'UNA ESTRATÈGIA LOCAL DE REHABILITACIÓ DE L'ENTORN CONSTRUÏT"}]
[null,null,null,null,null,null,null,null,null,null,null,null,null,null,null,null,null,null,null,null,null,null,null,null,{"$f":"IF($Y$2=\"\",\"\",$Y$2)","v":"ANNEX 1: PARTICIPACIÓ I GOVERNANÇA"}]
[null,null,null,null,null,null,null,null,null,null,null,null,null,null,null,null,null,null,null,{"$f":"TABLAS!$AL$4","v":""}]
[null,"Llegenda 1 - Nivells de participació"]
[]
[null,"1. Informar",null,null,null,"Objectiu de participació ciutadana: brindar informació equilibrada i objectiva per a ajudar-lo a comprendre el problema, les alternatives, les oportunitats i/o les solucions."]
[null,null,null,null,null,"Compromís amb la ciutadania: et mantindrem informat.\n\"Informar\" només implica un flux unidireccional d'informació de l'Administració als ciutadans; no obstant això, és una base important per a la participació de la comunitat, ja que genera coneixement i permet als ciutadans comprendre plenament l'acció i la decisió i arribar a les seues pròpies conclusions pel que fa a la idoneïtat i l'adequació de la decisió. \n\"Informar\" és apropiat en situacions en les quals la ciutadania no té l'oportunitat d'influir en la presa de decisions. "]
[]
[null,"2. Consultar",null,null,null,"Objectiu de participació ciutadana: obtindre puntualment l'opinió de la ciutadania i la resta d'agents en qualsevol fase de l'estratègia, així com arreplegar les seues propostes i alternatives. "]
[null,null,null,null,null,"Compromís amb la ciutadania: escoltarem i reconeixerem les seues aportacions i brindarem retroalimentació sobre com les van influir en la decisió.\n\"Consultar\" s'enfoca en la retroalimentació i és l'oportunitat mínima bàsica per a la participació del públic en una decisió: l'administració obté retroalimentació sobre plans, idees, opcions o problemes, però amb poca interacció. \n\"Consultar\" és apropiat quan es busquen aportacions específiques dels ciutadans per a la presa de decisions, així com votacions i prioritzacions en un moment concret. "]
[]
[null,"3. Implicar",null,null,null,"Objectiu de participació ciutadana: treballar amb la ciutadania i resta d'agents durant tot el procés per a assegurar-se que les opinions, preocupacions i aspiracions siguen considerades i compreses."]
[null,null,null,null,null,"Compromís amb la ciutadania: treballarem junts per a assegurar-nos que les seues preocupacions i aspiracions es reflectisquen directament en les alternatives desenvolupades.\n\"Implicar\" és un intercanvi d'informació bidireccional que fomenta espais de discussió i brinda l'oportunitat d'influir en l'estratègia plantejada.  Els agents estan presents en el procés generalment des del principi i se li brinden múltiples o contínues oportunitats d'aportació a mesura que avança la presa de decisions. En aquest nivell, la presa de decisions, generalment. continua estant en mans de l'Administració.\n\"Implicar\" és apropiat quan no s'aborden conflictes profunds o problemàtiques molt complexes i es disposa de capacitat per a treballar amb la ciutadania. "]
[]
[null,"4. Col·laborar",null,null,null,"Objectiu de participació ciutadana: associar-se amb la ciutadania i la resta d'agents en cada aspecte de la presa de decisions."]
[null,null,null,null,null,"Compromís amb la ciutadania: estaràs present en tot el procés per a obtindre assessorament directe i innovació en la formulació de solucions i incorporar les teues opinions, aportacions concretes i recomanacions en les decisions en la mesura que siga possible.\n\"Col·laborar\" implica que el públic està directament involucrat en la presa de decisions i està involucrat en un procés interactiu amb èmfasi en els processos bidireccionals. En general, l'objectiu és trobar solucions de consens (no de majories) i es negocia el grau de pes de la ciutadania i de l'Administració en la presa de decisions. Solen ser processos més complexos i llargs, en els quals cal crear llaços de confiança i espais de participació reconeguts, validats i legitimats per tots els agents implicats. Espais de participació estables, continuats i dotats fins i tot pressupostàriament. \n\"Col·laborar\" és adequat per a abordar temes controvertits i problemes complexos perquè implica un alt nivell de participació."]
[]
[{"$f":"TABLAS!$AL$2","v":"FITXES PER A L'ELABORACIÓ D'UNA ESTRATÈGIA LOCAL DE REHABILITACIÓ DE L'ENTORN CONSTRUÏT"}]
[null,null,null,null,null,null,null,null,null,null,null,null,null,null,null,null,null,null,null,null,null,null,null,null,{"$f":"IF($Y$2=\"\",\"\",$Y$2)","v":"ANNEX 1: PARTICIPACIÓ I GOVERNANÇA"}]
[null,null,null,null,null,null,null,null,null,null,null,null,null,null,null,null,null,null,null,{"$f":"TABLAS!$AL$4","v":""}]
[null,"Llegenda 2 - Espais i òrgans de participació"]
[]
[null,"GRUPS EXISTENTS, NO GENERATS ESPECÍFICAMENT PER A L'ESTRATÈGIA"]
[]
[null,null,null,"A1. Consells municipals o ciutadans",null,null,null,null,"Objectius: òrgans consultius amb l'objectiu de coordinar, estudiar, orientar, deliberar i dictaminar sobre assumptes dins de determinat àmbit d'interés municipal\nMembres: ciutadania en general, agents veïnals, representants de col·lectius, tècnics i polítics."]
[]
[null,"GRUPS GENERATS ESPECÍFICAMENT PER A L'ESTRATÈGIA"]
[]
[null,null,null,"B1. Grup motor",null,null,null,null,"Objectius: ser el “motor” del procés de participació. Dinamització i implicació directa amb el procés; retroalimentació i detecció de necessitats.\nMembres: és un grup voluntari obert de persones realment implicades en l'estratègia, amb les quals és possible treballar de manera continuada i que es responsabilitzen de part del procés. Aquest conjunt de persones són alhora font d'informació i nucli del procés. Es pot configurar tenint en compte la presència de membres dels diferents grups de població presents en el municipi. \nPeriodicitat: es reuneixen sovint, amb més intensitat durant la redacció de l'estratègia i la implementació d'accions concretes"]
[]
[null,null,null,"B2. Grups o comissions de treball",null,null,null,null,"Objectius: debat, reflexió, formació i elaboració de propostes.\nMembres: en general, grups de ciutadans i/o tècnics que sorgeixen segons necessitat o interés concret. En aquest cas, poden formar-se al voltant dels objectius, les línies d'actuació o les accions. També poden ser grups que ja estan treballant sectorialment en el municipi i poden constituir-se en mesos per àmbits (mobilitat, cultura, urbanisme, habitatge, etc.) \nPeriodicitat: es reuneixen periòdicament o segons necessitats i accions en marxa."]
[]
[null,null,null,"B3. Comissió de seguiment",null,null,null,null,"Objectius: vetlar per la transparència i el bon funcionament del procés, s'estableix com a espai formal d'interlocució, negociació i mediació entre ciutadania i l'Administració. \nMembres: representants del grup motor, portaveus de les comissions de treball, representants d'entitats, associacions i col·lectius ciutadans, representants de l'Administració (polítics i tècnics)\nPeriodicitat: en moments puntuals durant la redacció i implementació de l'estratègia (mínim una vegada a l'any o al final de cada fase)"]
[]
[null,"Llegenda 3 - Gestió participada d'espais"]
[]
[null,"A. GESTIÓ NO PARTICIPADA",null,null,null,null,null,null,"L'Administració o una entitat privada gestiona l'espai, infraestructura o servei i és la responsable del seu manteniment i finançament.\nLa ciutadania n'és usuària."]
[]
[null,"B. GESTIÓ PARTICIPADA",null,null,null,null,null,null,"Administració, ciutadania o entitats privades comparteixen recursos i gestionen col·laborativament, amb diferents pesos en la participació, segons acord previ."]
[]
[null,null,null,"B1. Col·laboració publicoprivada",null,null,null,null,"Gestió en què l'Administració pública col·labora amb una o diverses empreses o entitats privades. Hi ha diferents tipus de col·laboració que poden adquirir diferents formes jurídiques: convenis, partenariats, consorcis, fundacions de capital mixt, etc."]
[]
[null,null,null,"B2. Gestió cívica o ciutadana",null,null,null,null,"Instrument de col·laboració entre l'administració i la societat civil organitzada, que permet a la ciutadania implicar-se en la gestió d'espais, equipaments i serveis públics\nLa ciutadania i altres agents socials juntament amb l'Administració gestionen l'espai i aporten recursos financers, humans, tecnològics i operatius. El pes que tinguen cadascuna de les parts marcarà si s'aproxima més a models de cogestió en què l'Administració aporta molts recursos i fins i tot personal propi, o a models d'autogestió ciutadana en els quals l'Administració pot ser simplement l'agent que cedeix l'espai per a l'ús comunitari, o aporta una altra classe de recursos o ajudes de manera puntual."]

{"sheet":"TABLAS","index":14,"n_rows":543,"n_cols":38,"rows_kept":543,"cut":false,"hidden":true,"merged":[]}
["ANY","TRIMESTRE","DAFO","ACCIONS","Municipi (alfabèticament)","Àmbit geogràfic","Prioritat","Municipi","Codi municipi","Província","Comarca","Població del municipi","Risc de despoblament","TIPUS\n Vulnerabilitat\n ESPAI URBÀ SENSIBLE","EUS \n Àrees amb espais urbans sensibles","NIVELL vulnerabilitat inundació","NIVELL vulnerabilitat sisme","NIVELL Lloguer tensionat","ANHA Àrees de necessitat d'habitatge (ANHA PONDERAT)","Àmbit territorial de preu màxim superior ATPMS \n ","Superfície (km²)",null,"Planejament vigent",null,"PARC EDIFICATORI Conservació","PARC EDIFICATORI Accessibilitat","PARC EDIFICATORI Eficiència energètica",null,"URBANITZACIÓ",null,"ETAPA IV",null,"VERSIÓ",null,null,null,null,"TÍTOLS"]
[2021,"T1","EIX 1","X","Ademuz","Totalitat del municipi",1,"Atzúbia, l'","03001","Alacant","La Marina Alta",632,"No","Polivulnerabilitat baixa","No","Mitjana","Mitjana","Normal","-","A",14.67,null,"Pla general",null,"Es troba en ús?","Presenta barreres","Certificat",null,"Disseny/Conservació",null,"Vigent",null,"1.4v",null,null,null,null,"FITXES PER A L'ELABORACIÓ D'UNA ESTRATÈGIA LOCAL DE REHABILITACIÓ DE L'ENTORN CONSTRUÏT"]
[2022,"T2","EIX 2",null,"Ador","Una o diverses àrees del municipi",2,"Agost","03002","Alacant","L'Alacantí",4758,"No","Polivulnerabilitat baixa","No","Alta","Alta","Normal","Alta","A",66.635000000000005,null,"Normes subsidiàries",null,"Sí","No","Falta",null,"Molt alt",null,"Sí",null,null,null,null,null,null,"ETAPA I: IDENTIFICACIÓ DE L'ÀMBIT"]
[2023,"T3","EIX 3",null,"Agost","Àrees intermunicipals",3,"Agres","03003","Alacant","El Comtat",565,"No","Vulnerabilitat residual","No","Baixa","Alta","Normal","-","A",25.837,null,null,null,"No, amb previsió d'ús pròxim","Sí","A",null,"Alt",null,"No",null,null,null,null,null,null,""]
[2024,"T4","EIX 4",null,"Agres",null,null,"Aigües","03004","Alacant","L'Alacantí",963,"No","Polivulnerabilitat baixa","No","Mitjana","Alta","Normal","-","A",18.472999999999999,null,null,null,"No, sense previsió d'ús pròxim",null,"B",null,"Mitjà",null,null,null,null,null,null,null,null,"ETAPA II: ANÀLISI I DIAGNÒSTIC"]
[2025,null,"EIX 5",null,"Agullent",null,null,"Albatera","03005","Alacant","El Baix Segura",12279,"No","Polivulnerabilitat baixa","No","Mitjana","Alta","Normal","Baixa","A",61.542999999999999,null,null,null,null,"Instalacion ascensor","C",null,"Baix",null,"Estat",null,null,null,null,null,null,"ETAPA III: PROGRAMA D'ACTUACIONS"]
[2026,null,"EIX 6",null,"Aielo de Malferit",null,null,"Alcalalí","03006","Alacant","La Marina Alta",1278,"No","Polivulnerabilitat baixa","No","Mitjana","Mitjana","Normal","Baixa","A",14.398,null,null,null,"Nivell de manteniment","En buit d'escala ","D",null,"Molt baix",null,"Per desenvolupar",null,null,null,null,null,null,"ETAPA IV: IMPLEMENTACIÓ"]
[2027,null,"EIX 7",null,"Aielo de Rugat",null,null,"Alcocer de Planes","03007","Alacant","El Comtat",230,"No","Vulnerabilitat residual","No","Baixa","Alta","Normal","Alta","A",4.3869999999999996,null,null,null,"Adequat","En zona escala amb replanteig de l'escala","E",null,null,null,"En redacció",null,null,null,null,null,null,"ANNEX 1: PARTICIPACIÓ I GOVERNANÇA"]
[2028,null,"EIX 8",null,"Aigües",null,null,"Alcoleja","03008","Alacant","El Comtat",173,"Sí","Polivulnerabilitat mitjana","Sí","Baixa","Alta","Normal","-","A",14.558999999999999,null,null,null,"Regular","En pati interior","F",null,null,null,"En tramitació"]
[2029,null,"EIX 9",null,"Aín",null,null,"Alcoi","03009","Alacant","L'Alcoià",58994,"No","Polivulnerabilitat baixa","No","Mitjana","Mitjana","Normal","Alta","C-1",129.86099999999999,null,null,null,"Deficient","En façana amb ocupació de la via pública","G"]
[2030,null,"EIX 10",null,"Alacant",null,null,"Alfafara","03010","Alacant","El Comtat",410,"No","Vulnerabilitat residual","No","Mitjana","Alta","Normal","-","A",19.777999999999999,null,null,null,"Nul",null,"Millora envolupant",null,null,null,null,"Projecte",null,null,"Execució obra"]
[null,null,null,null,"Alaquàs",null,null,"Alfàs del Pi, l'","03011","Alacant","La Marina Baixa",20482,"No","Vulnerabilitat integral","Sí","Alta","Mitjana","Alt","Baixa","A",19.260000000000002,null,null,null,null,null,"No cal (orientatiu >2013)",null,null,null,"Tipus de contracte","Contractació","Redacció","Supervisió","Contactació","Execucció"]
[null,null,"DAFO ESCOGIDOS",null,"Albaida",null,null,"Algorfa","03012","Alacant","El Baix Segura",2935,"No","Polivulnerabilitat baixa","No","Alta","Alta","Normal","Baixa","A",18.471,null,null,null,"Estat de consevación",null,"Baixa (orientatiu 2006 - 2013)",null,null,null,"Menor","1-2 (1-4 en urb.)","1-2","1-2","1-4","1-3"]
[null,null,{"$f":"IF('ETAPA II.h'!A6=\"þ\",TABLAS!C2,\"\")","v":""},null,"Albal",null,null,"Algueña","03013","Alacant","El Vinalopó Mitjà",1336,"No","Polivulnerabilitat mitjana","Sí","Mitjana","Mitjana","Normal","-","A",18.433,null,null,null,"Bé",null,"Mitjana (orientatiu 1980 - 2006)",null,null,null,"Major","3-6","2-8","1-2","2-8","2-24"]
[null,null,{"$f":"IF('ETAPA II.h'!A56=\"þ\",TABLAS!C3,\"\")","v":""},null,"Albalat de la Ribera",null,null,"Alacant","03014","Alacant","L'Alacantí",334887,"No","Polivulnerabilitat baixa","No","Mitjana","Mitjana","Alt","Alta","A-2",201.26599999999999,null,null,null,"Regular",null,"Alta (orientatiu < 1980)"]
[null,null,{"$f":"IF('ETAPA II.h'!A108=\"þ\",TABLAS!C4,\"\")","v":""},null,"Albalat dels Sorells",null,null,"Almoradí","03015","Alacant","El Baix Segura",20803,"No","Vulnerabilitat integral","Sí","Alta","Alta","Normal","Alta","C-2",42.694000000000003,null,null,null,"Deficient"]
[null,null,{"$f":"IF('ETAPA II.h'!A159=\"þ\",TABLAS!C5,\"\")","v":""},null,"Albalat dels Tarongers",null,null,"Almudaina","03016","Alacant","El Comtat",113,"Sí","Polivulnerabilitat baixa","No","Mitjana","Alta","Normal","-","A",8.82,null,null,null,null,null,"Millora clima"]
[null,null,{"$f":"IF('ETAPA II.h'!A210=\"þ\",TABLAS!C6,\"\")","v":""},null,"Albatera",null,null,"Alqueria d'Asnar, l'","03017","Alacant","El Comtat",493,"No","Vulnerabilitat residual","No","Mitjana","Alta","Normal","-","A",1.0840000000000001,null,null,null,null,null,"No cal (orientatiu >2013)"]
[null,null,{"$f":"IF('ETAPA II.h'!A261=\"þ\",TABLAS!C7,\"\")","v":""},null,"Alberic",null,null,"Altea","03018","Alacant","La Marina Baixa",22290,"No","Polivulnerabilitat mitjana","No","Mitjana","Mitjana","Alt","Baixa","C-1",34.427999999999997,null,null,null,null,null,"Baixa (orientatiu 2006 - 2013)"]
[null,null,{"$f":"IF('ETAPA II.h'!A312=\"þ\",TABLAS!C8,\"\")","v":""},null,"Albocàsser",null,null,"Aspe","03019","Alacant","El Vinalopó Mitjà",20714,"No","Polivulnerabilitat mitjana","Sí","Mitjana","Alta","Normal","Alta","C-1",70.570999999999998,null,null,null,null,null,"Mitjana (orientatiu 1980 - 2006)"]
[null,null,{"$f":"IF('ETAPA II.h'!A364=\"þ\",TABLAS!C9,\"\")","v":""},null,"Alborache",null,null,"Balones","03020","Alacant","El Comtat",131,"Sí","Vulnerabilitat residual","No","Baixa","Alta","Normal","-","A",11.25,null,null,null,null,null,"Alta (orientatiu < 1980)"]
[null,null,{"$f":"IF('ETAPA II.h'!A415=\"þ\",TABLAS!C10,\"\")","v":""},null,"Alboraia",null,null,"Banyeres de Mariola","03021","Alacant","L'Alcoià",7068,"No","Polivulnerabilitat baixa","No","Baixa","Mitjana","Normal","Baixa","A",50.276000000000003]
[null,null,{"$f":"IF('ETAPA II.h'!A466=\"þ\",TABLAS!C11,\"\")","v":""},null,"Albuixech",null,null,"Benasau","03022","Alacant","El Comtat",151,"Sí","Polivulnerabilitat baixa","No","Baixa","Alta","Normal","-","A",9.0399999999999991]
[null,null,null,null,"Alcalà de Xivert",null,null,"Beneixama","03023","Alacant","L'Alt Vinalopó",1685,"No","Polivulnerabilitat baixa","No","Alta","Alta","Normal","-","A",34.887999999999998]
[null,null,"DAFO FILTRADOS",null,"Alcalalí",null,null,"Benejúzar","03024","Alacant","El Baix Segura",5402,"No","Vulnerabilitat integral","Sí","Alta","Alta","Normal","Alta","A",9.3279999999999994]
[null,null,null,null,"Alcàntera de Xúquer",null,null,"Benferri","03025","Alacant","El Baix Segura",1942,"No","Polivulnerabilitat baixa","No","Alta","Alta","Normal","Baixa","A",12.362]
[null,null,{"$f":"IFERROR(_xlfn._xlws.FILTER(C14:C23,C14:C23<>\"\"),\"\")","v":""},null,"Alcàsser",null,null,"Beniarbeig","03026","Alacant","La Marina Alta",2092,"No","Polivulnerabilitat mitjana","Sí","Alta","Mitjana","Alt","Baixa","A",7.4029999999999996,null,null,null,"Procés participatiu","II.b","II.c","II.e","II.f","III.c"]
[null,null,null,null,"Alcocer de Planes",null,null,"Beniardá","03027","Alacant","La Marina Baixa",232,"Sí","Polivulnerabilitat baixa","No","Baixa","Mitjana","Normal","-","A",15.739000000000001,null,null,null,"Sí, amb les dues","Titularitat edificis","Tipologia edificatòria","Estat de conservació majoritari","Antiguitat majoritària","Qualificació energètica"]
[null,null,null,null,"Alcoi",null,null,"Beniarrés","03028","Alacant","El Comtat",1118,"Sí","Polivulnerabilitat baixa","No","Mitjana","Alta","Normal","-","A",20.213999999999999,null,null,null,"S'ha assolit un grau elevat de consens amb les administracions territorials involucrades","Majoritàriament pública","Illa tancada","Bé","< 1950","A"]
[null,null,null,null,"Alcoleja",null,null,"Benigembla","03029","Alacant","La Marina Alta",490,"No","Polivulnerabilitat mitjana","Sí","Mitjana","Mitjana","Normal","-","A",18.454000000000001,null,null,null,"S'ha assolit un grau elevat de consens amb els sectors civils i econòmics involucrats","Majoritàriament privada","Edificació aïllada/exempta. Blocs","Regular","1950 - 1979","B"]
[null,null,null,null,"Alcora, l'",null,null,"Benidoleig","03030","Alacant","La Marina Alta",1095,"No","Polivulnerabilitat mitjana","Sí","Alta","Mitjana","Normal","-","A",7.484,null,null,null,"No, però ens trobem en procés d'aconseguir-ho","Inclou edificis de titularitat pública i privada","Antiguitat majoritària","Mal/Deficient/Ruïnós","> 1980","C"]
[null,null,null,null,"Alcublas",null,null,"Benidorm","03031","Alacant","La Marina Baixa",68721,"No","Polivulnerabilitat mitjana","No","Alta","Mitjana","Alt","Mitjana","B",38.51,null,null,null,"Cap consens de moment","Índex mitjà pobresa energètica","Anterior a 1950",null,"Tipologia edificatòria","D"]
[null,null,null,null,"Alcúdia de Crespins, l'",null,null,"Benifallim","03032","Alacant","L'Alcoià",105,"Sí","Vulnerabilitat residual","No","Baixa","Alta","Normal","-","A",13.688000000000001,null,null,null,null,"Baix","Entre 1950 i 1979",null,"Illa tancada","E"]
[null,null,null,null,"Alcudia de Veo",null,null,"Benifato","03033","Alacant","La Marina Baixa",140,"No","Polivulnerabilitat baixa","No","Baixa","Mitjana","Normal","-","A",11.881,null,null,null,null,"Mitjà","Posterior a 1980",null,"Aïllada. Bloc","No és procedent"]
[null,null,null,null,"Alcúdia, l'",null,null,"Benijófar","03034","Alacant","El Baix Segura",3322,"No","Polivulnerabilitat mitjana","Sí","Alta","Alta","Alt","-","A",4.3600000000000003,null,null,null,null,"Alt","Estat de conservació majoritari",null,"Estat de conservació majoritari"]
[null,null,null,null,"Aldaia",null,null,"Benilloba","03035","Alacant","El Comtat",724,"No","Polivulnerabilitat baixa","No","Baixa","Alta","Normal","Mitjana","A",9.5380000000000003,null,null,null,null,null,"Bo",null,"Bo"]
[null,null,null,null,"Alfafar",null,null,"Benillup","03036","Alacant","El Comtat",97,"Sí","Polivulnerabilitat baixa","No","Baixa","Alta","Normal","-","A",3.379,null,null,null,null,null,"Regular",null,"Regular"]
[null,null,null,null,"Alfafara",null,null,"Benimantell","03037","Alacant","La Marina Baixa",483,"No","Polivulnerabilitat baixa","No","Baixa","Alta","Normal","-","A",37.927999999999997,null,null,null,null,null,"Roín/Deficient/Ruïnós",null,"Deficient"]
[null,null,null,null,"Alfara de la Baronia",null,null,"Benimarfull","03038","Alacant","El Comtat",409,"No","Vulnerabilitat residual","No","Mitjana","Alta","Normal","-","A",5.5640000000000001]
[null,null,null,null,"Alfara del Patriarca",null,null,"Benimassot","03039","Alacant","El Comtat",106,"Sí","Polivulnerabilitat baixa","No","Baixa","Alta","Normal","-","A",9.5129999999999999]
[null,null,null,null,"Alfarp",null,null,"Benimeli","03040","Alacant","La Marina Alta",418,"No","Polivulnerabilitat mitjana","Sí","Alta","Mitjana","Normal","-","A",3.5049999999999999]
[null,null,null,null,"Alfarrasí",null,null,"Benissa","03041","Alacant","La Marina Alta",11005,"No","Polivulnerabilitat baixa","No","Mitjana","Mitjana","Normal","Baixa","A",69.706999999999994]
[null,null,null,null,"Alfàs del Pi, l'",null,null,"Poble Nou de Benitatxell, el","03042","Alacant","La Marina Alta",4276,"No","Polivulnerabilitat mitjana","Sí","Baixa","Mitjana","Alt","-","A",12.654]
[null,null,null,null,"Alfauir",null,null,"Biar","03043","Alacant","L'Alt Vinalopó",3671,"No","Vulnerabilitat residual","No","Mitjana","Alta","Normal","Mitjana","A",98.165000000000006]
[null,null,null,null,"Alfondeguilla",null,null,"Bigastro","03044","Alacant","El Baix Segura",6733,"No","Polivulnerabilitat baixa","No","Alta","Alta","Normal","Baixa","A",4.0979999999999999]
[null,null,null,null,"Algar de Palancia",null,null,"Bolulla","03045","Alacant","La Marina Baixa",420,"No","Polivulnerabilitat baixa","No","Baixa","Mitjana","Normal","-","A",13.571999999999999]
[null,null,null,null,"Algemesí",null,null,"Busot","03046","Alacant","L'Alacantí",2978,"No","Vulnerabilitat residual","No","Mitjana","Mitjana","Normal","Baixa","A",33.841999999999999]
[null,null,null,null,"Algímia d'Alfara",null,null,"Calp","03047","Alacant","La Marina Alta",22725,"No","Polivulnerabilitat mitjana","Sí","Alta","Baixa","Alt","Baixa","C-1",23.509]
[null,null,null,null,"Algimia de Almonacid",null,null,"Callosa d'en Sarrià","03048","Alacant","La Marina Baixa",7373,"No","Polivulnerabilitat mitjana","Sí","Mitjana","Mitjana","Normal","Baixa","A",34.661999999999999]
[null,null,null,null,"Alginet",null,null,"Callosa de Segura","03049","Alacant","El Baix Segura",19038,"No","Vulnerabilitat integral","Sí","Alta","Alta","Normal","Alta","A",24.832000000000001]
[null,null,null,null,"Algorfa",null,null,"el Campello, el","03050","Alacant","L'Alacantí",28349,"No","Vulnerabilitat residual","No","Alta","Mitjana","Alt","Alta","B",55.268000000000001]
[null,null,null,null,"Algueña",null,null,"Camp de Mirra, el","03051","Alacant","L'Alt Vinalopó",415,"No","Polivulnerabilitat mitjana","Sí","Baixa","Alta","Normal","Mitjana","A",21.815999999999999]
[null,null,null,null,"Almàssera",null,null,"Cañada","03052","Alacant","L'Alt Vinalopó",1220,"No","Vulnerabilitat residual","No","Alta","Mitjana","Normal","-","A",19.324000000000002]
[null,null,null,null,"Almassora",null,null,"Castalla","03053","Alacant","L'Alcoià",10124,"No","Vulnerabilitat residual","No","Mitjana","Mitjana","Normal","Mitjana","C-2",114.6]
[null,null,null,null,"Almedíjar",null,null,"Castell de Castells","03054","Alacant","La Marina Alta",449,"Sí","Polivulnerabilitat mitjana","Sí","Baixa","Alta","Normal","-","A",45.927]
[null,null,null,null,"Almenara",null,null,"Catral","03055","Alacant","El Baix Segura",8639,"No","Polivulnerabilitat mitjana","Sí","Alta","Alta","Normal","Baixa","A",20.007999999999999]
[null,null,null,null,"Almiserà",null,null,"Cocentaina","03056","Alacant","El Comtat",11511,"No","Polivulnerabilitat baixa","No","Mitjana","Alta","Normal","Baixa","A",52.945]
[null,null,null,null,"Almoines",null,null,"Confrides","03057","Alacant","La Marina Baixa",187,"Sí","Vulnerabilitat integral","Sí","Baixa","Alta","Normal","-","A",39.982999999999997]
[null,null,null,null,"Almoradí",null,null,"Cox","03058","Alacant","El Baix Segura",7297,"No","Vulnerabilitat integral","Sí","Alta","Alta","Normal","Baixa","A",16.71]
[null,null,null,null,"Almudaina",null,null,"Crevillent","03059","Alacant","El Baix Vinalopó",28952,"No","Vulnerabilitat integral","Sí","Alta","Alta","Normal","Mitjana","C-1",104.55]
[null,null,null,null,"Almussafes",null,null,"Quatretondeta","03060","Alacant","El Comtat",122,"Sí","Polivulnerabilitat baixa","No","Mitjana","Alta","Normal","-","A",16.704999999999998]
[null,null,null,null,"Alpuente",null,null,"Daya Nueva","03061","Alacant","El Baix Segura",1737,"No","Vulnerabilitat integral","Sí","Alta","Alta","Normal","-","A",7.093]
[null,null,null,null,"Alqueria d'Asnar, l'",null,null,"Daya Vieja","03062","Alacant","El Baix Segura",690,"No","Vulnerabilitat integral","Sí","Alta","Alta","Normal","-","A",3.1429999999999998]
[null,null,null,null,"Alqueria de la Comtessa, l'",null,null,"Dénia","03063","Alacant","La Marina Alta",42166,"No","Polivulnerabilitat mitjana","Sí","Alta","Mitjana","Alt","Alta","C-1",66.179000000000002]
[null,null,null,null,"Alqueries, les",null,null,"Dolores","03064","Alacant","El Baix Segura",7470,"No","Vulnerabilitat integral","Sí","Alta","Alta","Normal","Mitjana","A",18.701000000000001]
[null,null,null,null,"Altea",null,null,"Elx","03065","Alacant","El Baix Vinalopó",232517,"No","Polivulnerabilitat mitjana","Sí","Mitjana","Alta","Alt","Alta","B",326.50099999999998]
[null,null,null,null,"Altura",null,null,"Elda","03066","Alacant","El Vinalopó Mitjà",52618,"No","Polivulnerabilitat mitjana","Sí","Alta","Mitjana","Normal","Alta","C-1",45.789000000000001]
[null,null,null,null,"Alzira",null,null,"Facheca","03067","Alacant","El Comtat",106,"Sí","Polivulnerabilitat mitjana","Sí","Baixa","Alta","Normal","-","A",10.175000000000001]
[null,null,null,null,"Andilla",null,null,"Famorca","03068","Alacant","El Comtat",47,"Sí","Polivulnerabilitat mitjana","Sí","Baixa","Alta","Normal","-","A",9.7240000000000002]
[null,null,null,null,"Anna",null,null,"Finestrat","03069","Alacant","La Marina Baixa",6715,"No","Polivulnerabilitat baixa","No","Alta","Mitjana","Alt","Baixa","A",42.253999999999998]
[null,null,null,null,"Antella",null,null,"Formentera del Segura","03070","Alacant","El Baix Segura",4191,"No","Vulnerabilitat integral","Sí","Alta","Alta","Normal","Mitjana","A",4.3319999999999999]
[null,null,null,null,"Arañuel",null,null,"Gata de Gorgos","03071","Alacant","La Marina Alta",6049,"No","Vulnerabilitat integral","Sí","Mitjana","Mitjana","Normal","Mitjana","A",20.332000000000001]
[null,null,null,null,"Aras de los Olmos",null,null,"Gaianes","03072","Alacant","El Comtat",452,"No","Polivulnerabilitat baixa","No","Alta","Alta","Normal","-","A",9.5709999999999997]
[null,null,null,null,"Ares del Maestrat",null,null,"Gorga","03073","Alacant","El Comtat",249,"No","Polivulnerabilitat mitjana","No","Alta","Alta","Normal","-","A",9.1069999999999993]
[null,null,null,null,"Argelita",null,null,"Granja de Rocamora","03074","Alacant","El Baix Segura",2580,"No","Vulnerabilitat integral","Sí","Alta","Alta","Normal","-","A",7.1689999999999996]
[null,null,null,null,"Artana",null,null,"Castell de Guadalest, el","03075","Alacant","La Marina Baixa",217,"No","Polivulnerabilitat baixa","No","Baixa","Alta","Normal","-","A",15.96]
[null,null,null,null,"Aspe",null,null,"Guardamar del Segura","03076","Alacant","El Baix Segura",15348,"No","Polivulnerabilitat mitjana","Sí","Mitjana","Alta","Alt","Baixa","C-1",33.936999999999998]
[null,null,null,null,"Atzeneta d'Albaida",null,null,"Fondó de les Neus, el","03077","Alacant","El Vinalopó Mitjà",2544,"No","Polivulnerabilitat baixa","No","Alta","Alta","Normal","Baixa","A",68.852000000000004]
[null,null,null,null,"Atzeneta del Maestrat",null,null,"Hondón de los Frailes","03078","Alacant","El Vinalopó Mitjà",1198,"No","Polivulnerabilitat baixa","No","Mitjana","Alta","Normal","-","A",12.545999999999999]
[null,null,null,null,"Atzúbia, l'",null,null,"Ibi","03079","Alacant","L'Alcoià",23489,"No","Polivulnerabilitat baixa","No","Alta","Alta","Normal","-","C-2",62.524000000000001]
[null,null,null,null,"Ayódar",null,null,"Jacarilla","03080","Alacant","El Baix Segura",2022,"No","Polivulnerabilitat mitjana","Sí","Mitjana","Alta","Normal","-","A",12.204000000000001]
[null,null,null,null,"Ayora",null,null,"Xaló","03081","Alacant","La Marina Alta",2739,"No","Vulnerabilitat integral","Sí","Alta","Mitjana","Normal","-","A",34.585999999999999]
[null,null,null,null,"Azuébar",null,null,"Xàbia","03082","Alacant","La Marina Alta",27604,"No","Polivulnerabilitat baixa","No","Alta","Baixa","Alt","Mitjana","C-1",68.59]
[null,null,null,null,"Balones",null,null,"Xixona","03083","Alacant","L'Alacantí",6865,"No","Polivulnerabilitat mitjana","No","Baixa","Alta","Normal","Mitjana","A",163.761]
[null,null,null,null,"Banyeres de Mariola",null,null,"Orxa, l'","03084","Alacant","El Comtat",578,"Sí","Polivulnerabilitat baixa","No","Alta","Alta","Normal","-","A",31.765000000000001]
[null,null,null,null,"Barracas",null,null,"Llíber","03085","Alacant","La Marina Alta",935,"No","Polivulnerabilitat baixa","No","Alta","Mitjana","Normal","-","A",21.933]
[null,null,null,null,"Barx",null,null,"Millena","03086","Alacant","El Comtat",237,"No","Polivulnerabilitat baixa","No","Baixa","Alta","Normal","-","A",9.7729999999999997]
[null,null,null,null,"Barxeta",null,null,"Monforte del Cid","03088","Alacant","El Vinalopó Mitjà",8165,"No","Polivulnerabilitat mitjana","No","Mitjana","Alta","Normal","Mitjana","C-1",79.522000000000006]
[null,null,null,null,"Bejís",null,null,"Monòver","03089","Alacant","El Vinalopó Mitjà",12167,"No","Polivulnerabilitat mitjana","Sí","Mitjana","Alta","Normal","Alta","A",152.357]
[null,null,null,null,"Bèlgida",null,null,"Mutxamel","03090","Alacant","L'Alacantí",25352,"No","Vulnerabilitat residual","No","Mitjana","Mitjana","Alt","Mitjana","B",47.652999999999999]
[null,null,null,null,"Bellreguard",null,null,"Murla","03091","Alacant","La Marina Alta",470,"No","Polivulnerabilitat baixa","No","Baixa","Mitjana","Normal","-","A",5.8129999999999997]
[null,null,null,null,"Bellús",null,null,"Muro de Alcoy","03092","Alacant","El Comtat",9324,"No","Vulnerabilitat residual","No","Alta","Alta","Normal","Baixa","A",30.244]
[null,null,null,null,"Benafer",null,null,"Novelda","03093","Alacant","El Vinalopó Mitjà",25651,"No","Polivulnerabilitat mitjana","Sí","Mitjana","Alta","Normal","Alta","C-1",75.724000000000004]
[null,null,null,null,"Benafigos",null,null,"Nucia, la","03094","Alacant","La Marina Baixa",18603,"No","Polivulnerabilitat baixa","No","Mitjana","Mitjana","Alt","Mitjana","A",21.361000000000001]
[null,null,null,null,"Benagéber",null,null,"Ondara","03095","Alacant","La Marina Alta",6894,"No","Vulnerabilitat integral","Sí","Alta","Mitjana","Normal","Alta","A",10.413]
[null,null,null,null,"Benaguasil",null,null,"Onil","03096","Alacant","L'Alcoià",7507,"No","Polivulnerabilitat baixa","No","Alta","Mitjana","Normal","Baixa","C-2",48.41]
[null,null,null,null,"Benasau",null,null,"Orba","03097","Alacant","La Marina Alta",2174,"No","Polivulnerabilitat mitjana","Sí","Mitjana","Mitjana","Normal","Baixa","A",17.73]
[null,null,null,null,"Benassal",null,null,"Orxeta","03098","Alacant","La Marina Baixa",736,"No","Polivulnerabilitat baixa","No","Mitjana","Mitjana","Normal","-","A",24.062000000000001]
[null,null,null,null,"Benavites",null,null,"Orihuela","03099","Alacant","El Baix Segura",77414,"No","Vulnerabilitat integral","Sí","Alta","Alta","Alt","Mitjana","C-1",365.43599999999998]
[null,null,null,null,"Beneixama",null,null,"Parcent","03100","Alacant","La Marina Alta",929,"No","Polivulnerabilitat mitjana","Sí","Mitjana","Mitjana","Normal","-","A",11.77]
[null,null,null,null,"Beneixida",null,null,"Pedreguer","03101","Alacant","La Marina Alta",7699,"No","Polivulnerabilitat baixa","No","Alta","Mitjana","Normal","Alta","A",29.582000000000001]
[null,null,null,null,"Benejúzar",null,null,"Pego","03102","Alacant","La Marina Alta",10128,"No","Polivulnerabilitat baixa","No","Mitjana","Mitjana","Normal","Baixa","A",52.847000000000001]
[null,null,null,null,"Benetússer",null,null,"Penàguila","03103","Alacant","L'Alcoià",292,"Sí","Vulnerabilitat residual","No","Baixa","Alta","Normal","-","A",49.924999999999997]
[null,null,null,null,"Benferri",null,null,"Petrer","03104","Alacant","El Vinalopó Mitjà",34276,"No","Polivulnerabilitat mitjana","No","Mitjana","Mitjana","Alt","Alta","C-1",104.09099999999999]
[null,null,null,null,"Beniarbeig",null,null,"Pinós, el","03105","Alacant","El Vinalopó Mitjà",7966,"No","Polivulnerabilitat mitjana","Sí","Alta","Mitjana","Normal","Alta","A",126.479]
[null,null,null,null,"Beniardá",null,null,"Plans","03106","Alacant","El Comtat",693,"Sí","Polivulnerabilitat baixa","No","Baixa","Alta","Normal","-","A",38.868000000000002]
[null,null,null,null,"Beniarjó",null,null,"Polop","03107","Alacant","La Marina Baixa",4965,"No","Polivulnerabilitat baixa","No","Alta","Mitjana","Normal","Baixa","A",22.559000000000001]
[null,null,null,null,"Beniarrés",null,null,"Rafal","03109","Alacant","El Baix Segura",4498,"No","Vulnerabilitat integral","Sí","Alta","Alta","Normal","Baixa","A",1.6220000000000001]
[null,null,null,null,"Beniatjar",null,null,"Ràfol d'Almúnia, el","03110","Alacant","La Marina Alta",653,"No","Polivulnerabilitat mitjana","Sí","Mitjana","Mitjana","Normal","-","A",4.8780000000000001]
[null,null,null,null,"Benicarló",null,null,"Redován","03111","Alacant","El Baix Segura",7869,"No","Vulnerabilitat integral","Sí","Alta","Alta","Normal","Mitjana","A",9.4480000000000004]
[null,null,null,null,"Benicàssim",null,null,"Relleu","03112","Alacant","La Marina Baixa",1160,"No","Polivulnerabilitat baixa","No","Baixa","Alta","Normal","-","A",76.872]
[null,null,null,null,"Benicolet",null,null,"Rojales","03113","Alacant","El Baix Segura",16963,"No","Vulnerabilitat integral","Sí","Alta","Alta","Normal","Mitjana","A",27.728999999999999]
[null,null,null,null,"Benicull de Xúquer",null,null,"Romana, la","03114","Alacant","El Vinalopó Mitjà",2434,"No","Polivulnerabilitat mitjana","Sí","Mitjana","Alta","Normal","-","A",43.293999999999997]
[null,null,null,null,"Benidoleig",null,null,"Sagra","03115","Alacant","La Marina Alta",408,"Sí","Polivulnerabilitat mitjana","Sí","Alta","Mitjana","Normal","-","A",5.6189999999999998]
[null,null,null,null,"Benidorm",null,null,"Salinas","03116","Alacant","L'Alt Vinalopó",1601,"No","Polivulnerabilitat mitjana","No","Alta","Mitjana","Normal","-","A",61.712000000000003]
[null,null,null,null,"Benifaió",null,null,"Sanet y Negrals","03117","Alacant","La Marina Alta",667,"No","Polivulnerabilitat mitjana","Sí","Mitjana","Mitjana","Normal","Mitjana","A",3.9420000000000002]
[null,null,null,null,"Benifairó de la Valldigna",null,null,"San Fulgencio","03118","Alacant","El Baix Segura",7855,"No","Polivulnerabilitat mitjana","Sí","Alta","Alta","Normal","Baixa","A",20.701000000000001]
[null,null,null,null,"Benifairó de les Valls",null,null,"Sant Joan d'Alacant","03119","Alacant","L'Alacantí",23915,"No","Vulnerabilitat residual","No","Mitjana","Mitjana","Alt","Alta","B",9.6389999999999993]
[null,null,null,null,"Benifallim",null,null,"San Miguel de Salinas","03120","Alacant","El Baix Segura",6034,"No","Vulnerabilitat integral","Sí","Mitjana","Alta","Normal","Alta","A",54.845999999999997]
[null,null,null,null,"Benifato",null,null,"Santa Pola","03121","Alacant","El Baix Vinalopó",32306,"No","Polivulnerabilitat baixa","No","Alta","Alta","Alt","Alta","C-1",58.161000000000001]
[null,null,null,null,"Beniflá",null,null,"Sant Vicent del Raspeig","03122","Alacant","L'Alacantí",58385,"No","Polivulnerabilitat baixa","No","Mitjana","Mitjana","Alt","Alta","B",40.551000000000002]
[null,null,null,null,"Benigànim",null,null,"Sax","03123","Alacant","L'Alt Vinalopó",9845,"No","Polivulnerabilitat mitjana","Sí","Mitjana","Mitjana","Normal","Alta","A",63.484000000000002]
[null,null,null,null,"Benigembla",null,null,"Sella","03124","Alacant","La Marina Baixa",580,"No","Polivulnerabilitat baixa","No","Baixa","Alta","Normal","-","A",38.720999999999997]
[null,null,null,null,"Benijófar",null,null,"Senija","03125","Alacant","La Marina Alta",584,"No","Vulnerabilitat integral","Sí","Mitjana","Mitjana","Normal","-","A",4.7859999999999996]
[null,null,null,null,"Benilloba",null,null,"Tàrbena","03127","Alacant","La Marina Baixa",646,"Sí","Vulnerabilitat integral","Sí","Baixa","Mitjana","Normal","-","A",31.67]
[null,null,null,null,"Benillup",null,null,"Teulada","03128","Alacant","La Marina Alta",11112,"No","Polivulnerabilitat mitjana","Sí","Mitjana","Mitjana","Alt","Baixa","A",32.25]
[null,null,null,null,"Benimantell",null,null,"Tibi","03129","Alacant","L'Alcoià",1614,"No","Vulnerabilitat residual","No","Baixa","Mitjana","Normal","-","A",70.382999999999996]
[null,null,null,null,"Benimarfull",null,null,"Tollos","03130","Alacant","El Comtat",57,"Sí","Polivulnerabilitat baixa","No","Baixa","Alta","Normal","Alta","A",15.973000000000001]
[null,null,null,null,"Benimassot",null,null,"Tormos","03131","Alacant","La Marina Alta",340,"No","Vulnerabilitat residual","No","Baixa","Alta","Normal","-","A",5.36]
[null,null,null,null,"Benimeli",null,null,"Torre de les Maçanes, la","03132","Alacant","L'Alacantí",661,"No","Polivulnerabilitat baixa","No","Baixa","Alta","Normal","-","A",36.479999999999997]
[null,null,null,null,"Benimodo",null,null,"Torrevieja","03133","Alacant","El Baix Segura",83337,"No","Polivulnerabilitat mitjana","Sí","Mitjana","Alta","Alt","Alta","A",71.760000000000005]
[null,null,null,null,"Benimuslem",null,null,"Vall d'Alcalà, la","03134","Alacant","La Marina Alta",167,"Sí","Polivulnerabilitat mitjana","No","Baixa","Alta","Normal","-","C-1",22.850999999999999]
[null,null,null,null,"Beniparrell",null,null,"Vall d'Ebo, la","03135","Alacant","La Marina Alta",216,"Sí","Vulnerabilitat residual","No","Alta","Mitjana","Normal","-","A",32.424999999999997]
[null,null,null,null,"Benirredrà",null,null,"Vall de Gallinera","03136","Alacant","La Marina Alta",571,"Sí","Vulnerabilitat residual","No","Mitjana","Alta","Normal","-","A",53.633000000000003]
[null,null,null,null,"Benissa",null,null,"Vall de Laguar, la","03137","Alacant","La Marina Alta",846,"No","Polivulnerabilitat mitjana","Sí","Baixa","Mitjana","Normal","Mitjana","A",23.053999999999998]
[null,null,null,null,"Benissanó",null,null,"Verger, el","03138","Alacant","La Marina Alta",4640,"No","Polivulnerabilitat mitjana","Sí","Alta","Mitjana","Normal","Alta","A",8.1590000000000007]
[null,null,null,null,"Benissoda",null,null,"Vila Joiosa, la","03139","Alacant","La Marina Baixa",34673,"No","Polivulnerabilitat mitjana","Sí","Mitjana","Mitjana","Alt","Baixa","A",59.247999999999998]
[null,null,null,null,"Benissuera",null,null,"Villena","03140","Alacant","L'Alt Vinalopó",33964,"No","Polivulnerabilitat mitjana","Sí","Alta","Mitjana","Normal","Mitjana","C-1",345.37]
[null,null,null,null,"Benlloc",null,null,"Poblets, els","03901","Alacant","La Marina Alta",2705,"No","Polivulnerabilitat mitjana","Sí","Alta","Mitjana","Normal","-","C-1",3.621]
[null,null,null,null,"Bétera",null,null,"Pilar de la Horadada","03902","Alacant","El Baix Segura",21905,"No","Polivulnerabilitat mitjana","Sí","Alta","Alta","Normal","Alta","A",77.855000000000004]
[null,null,null,null,"Betxí",null,null,"Montesinos, Los","03903","Alacant","El Baix Segura",4968,"No","Vulnerabilitat integral","Sí","Baixa","Alta","Normal","Baixa","A",14.99]
[null,null,null,null,"Biar",null,null,"San Isidro","03904","Alacant","El Baix Segura",1986,"No","Polivulnerabilitat baixa","No","Alta","Alta","Alt","-","A",11.699]
[null,null,null,null,"Bicorp",null,null,"Atzeneta del Maestrat","12001","Castelló","L'Alcalatén",1276,"Sí","Polivulnerabilitat baixa","No","Alta","Baixa","Normal","-","A",71.158000000000001]
[null,null,null,null,"Bigastro",null,null,"Aín","12002","Castelló","La Plana Baixa",127,"Sí","Vulnerabilitat residual","No","Baixa","Baixa","Normal","-","A",12.29]
[null,null,null,null,"Bocairent",null,null,"Albocàsser","12003","Castelló","L'Alt Maestrat",1241,"Sí","Polivulnerabilitat baixa","No","Mitjana","Baixa","Normal","-","A",82.292000000000002]
[null,null,null,null,"Bolbaite",null,null,"Alcalà de Xivert","12004","Castelló","El Baix Maestrat",6680,"No","Polivulnerabilitat mitjana","Sí","Alta","Baixa","Normal","Baixa","A",167.559]
[null,null,null,null,"Bolulla",null,null,"Alcora, l'","12005","Castelló","L'Alcalatén",10405,"No","Vulnerabilitat residual","No","Mitjana","Baixa","Normal","Mitjana","A",95.176000000000002]
[null,null,null,null,"Bonrepòs i Mirambell",null,null,"Alcudia de Veo","12006","Castelló","La Plana Baixa",190,"No","Vulnerabilitat residual","No","Baixa","Baixa","Normal","Mitjana","A",30.658000000000001]
[null,null,null,null,"Borriana",null,null,"Alfondeguilla","12007","Castelló","La Plana Baixa",866,"No","Vulnerabilitat residual","No","Alta","Baixa","Normal","-","A",28.327999999999999]
[null,null,null,null,"Borriol",null,null,"Algimia de Almonacid","12008","Castelló","L'Alt Palància",263,"Sí","Polivulnerabilitat baixa","No","Baixa","Baixa","Normal","-","A",20.332999999999998]
[null,null,null,null,"Bufali",null,null,"Almassora","12009","Castelló","La Plana Alta",26270,"No","Vulnerabilitat residual","No","Alta","Baixa","Normal","Mitjana","C-1",32.973999999999997]
[null,null,null,null,"Bugarra",null,null,"Almedíjar","12010","Castelló","L'Alt Palància",254,"Sí","Vulnerabilitat residual","No","Alta","Baixa","Normal","-","A",20.899000000000001]
[null,null,null,null,"Buñol",null,null,"Almenara","12011","Castelló","La Plana Baixa",5998,"No","Vulnerabilitat residual","No","Alta","Baixa","Normal","Baixa","A",27.626000000000001]
[null,null,null,null,"Burjassot",null,null,"Altura","12012","Castelló","L'Alt Palància",3528,"No","Vulnerabilitat residual","No","Mitjana","Baixa","Normal","-","A",129.565]
[null,null,null,null,"Busot",null,null,"Arañuel","12013","Castelló","L'Alt Millars",150,"Sí","Polivulnerabilitat baixa","No","Mitjana","Baixa","Normal","-","A",19.161000000000001]
[null,null,null,null,"Cabanes",null,null,"Ares del Maestrat","12014","Castelló","L'Alt Maestrat",186,"Sí","Polivulnerabilitat mitjana","Sí","Baixa","Baixa","Normal","-","A",118.669]
[null,null,null,null,"Càlig",null,null,"Argelita","12015","Castelló","L'Alt Millars",118,"Sí","Polivulnerabilitat baixa","No","Mitjana","Baixa","Normal","-","A",15.47]
[null,null,null,null,"Calles",null,null,"Artana","12016","Castelló","La Plana Baixa",1947,"No","Polivulnerabilitat baixa","No","Mitjana","Baixa","Normal","-","A",36.331000000000003]
[null,null,null,null,"Callosa de Segura",null,null,"Ayódar","12017","Castelló","L'Alt Millars",159,"Sí","Polivulnerabilitat mitjana","Sí","Mitjana","Baixa","Normal","-","A",24.364000000000001]
[null,null,null,null,"Callosa d'en Sarrià",null,null,"Azuébar","12018","Castelló","L'Alt Palància",315,"Sí","Vulnerabilitat residual","No","Alta","Baixa","Normal","-","A",23.401]
[null,null,null,null,"Calp",null,null,"Barracas","12020","Castelló","L'Alt Palància",162,"No","Polivulnerabilitat baixa","No","Alta","Baixa","Normal","-","A",42.149000000000001]
[null,null,null,null,"Camp de Mirra, el",null,null,"Betxí","12021","Castelló","La Plana Baixa",5645,"No","Vulnerabilitat residual","No","Alta","Baixa","Normal","-","A",21.44]
[null,null,null,null,"Campello, el",null,null,"Bejís","12022","Castelló","L'Alt Palància",380,"Sí","Polivulnerabilitat baixa","No","Baixa","Baixa","Normal","-","A",42.353000000000002]
[null,null,null,null,"Camporrobles",null,null,"Benafer","12024","Castelló","L'Alt Palància",152,"No","Vulnerabilitat residual","No","Mitjana","Baixa","Normal","-","A",17.033000000000001]
[null,null,null,null,"Cañada",null,null,"Benafigos","12025","Castelló","L'Alcalatén",142,"Sí","Polivulnerabilitat baixa","No","Baixa","Baixa","Normal","-","A",35.6]
[null,null,null,null,"Canals",null,null,"Benassal","12026","Castelló","L'Alt Maestrat",1068,"Sí","Polivulnerabilitat baixa","No","Mitjana","Baixa","Alt","-","A",79.578000000000003]
[null,null,null,null,"Canet d'en Berenguer",null,null,"Benicarló","12027","Castelló","El Baix Maestrat",26912,"No","Polivulnerabilitat mitjana","Sí","Alta","Baixa","Normal","Alta","C-1",47.863999999999997]
[null,null,null,null,"Canet lo Roig",null,null,"Benicàssim","12028","Castelló","La Plana Alta",18192,"No","Vulnerabilitat residual","No","Alta","Baixa","Alt","Mitjana","B",36.228999999999999]
[null,null,null,null,"Carcaixent",null,null,"Benlloc","12029","Castelló","La Plana Alta",1033,"No","Polivulnerabilitat baixa","No","Mitjana","Baixa","Normal","-","A",43.521999999999998]
[null,null,null,null,"Càrcer",null,null,"Borriol","12031","Castelló","La Plana Alta",5360,"No","Vulnerabilitat residual","No","Mitjana","Baixa","Normal","Mitjana","C-1",61.555999999999997]
[null,null,null,null,"Carlet",null,null,"Borriana","12032","Castelló","La Plana Baixa",34683,"No","Polivulnerabilitat baixa","No","Alta","Baixa","Normal","Alta","B",46.994]
[null,null,null,null,"Carrícola",null,null,"Cabanes","12033","Castelló","La Plana Alta",2958,"No","Polivulnerabilitat baixa","No","Alta","Baixa","Normal","Baixa","A",131.637]
[null,null,null,null,"Casas Altas",null,null,"Càlig","12034","Castelló","El Baix Maestrat",1950,"No","Polivulnerabilitat mitjana","Sí","Mitjana","Baixa","Normal","Mitjana","A",27.466000000000001]
[null,null,null,null,"Casas Bajas",null,null,"Canet lo Roig","12036","Castelló","El Baix Maestrat",674,"Sí","Polivulnerabilitat baixa","No","Baixa","Baixa","Normal","-","A",68.680000000000007]
[null,null,null,null,"Casinos",null,null,"Castell de Cabres","12037","Castelló","El Baix Maestrat",17,"Sí","Polivulnerabilitat baixa","No","Baixa","Baixa","Normal","-","A",30.721]
[null,null,null,null,"Castalla",null,null,"Castellfort","12038","Castelló","Els Ports",183,"Sí","Vulnerabilitat residual","No","Baixa","Baixa","Normal","-","A",66.736999999999995]
[null,null,null,null,"Castell de Cabres",null,null,"Castellnovo","12039","Castelló","L'Alt Palància",917,"Sí","Vulnerabilitat residual","No","Mitjana","Baixa","Normal","-","A",19.202999999999999]
[null,null,null,null,"Castell de Castells",null,null,"Castelló de la Plana","12040","Castelló","La Plana Alta",171728,"No","Vulnerabilitat residual","No","Alta","Baixa","Alt","Alta","A-2",111.325]
[null,null,null,null,"Castell de Guadalest, el",null,null,"Castillo de Villamalefa","12041","Castelló","L'Alt Millars",107,"Sí","Vulnerabilitat integral","Sí","Baixa","Baixa","Normal","-","A",37.74]
[null,null,null,null,"Castellfort",null,null,"Catí","12042","Castelló","L'Alt Maestrat",721,"Sí","Polivulnerabilitat baixa","No","Alta","Baixa","Normal","-","A",102.346]
[null,null,null,null,"Castellnovo",null,null,"Caudiel","12043","Castelló","L'Alt Palància",664,"Sí","Polivulnerabilitat baixa","No","Alta","Baixa","Normal","-","A",62.381]
[null,null,null,null,"Castelló",null,null,"Cervera del Maestre","12044","Castelló","El Baix Maestrat",575,"Sí","Vulnerabilitat integral","Sí","Baixa","Baixa","Normal","-","A",93.234999999999999]
[null,null,null,null,"Castelló de la Plana",null,null,"Cinctorres","12045","Castelló","Els Ports",391,"Sí","Polivulnerabilitat baixa","No","Baixa","Baixa","Normal","-","A",35.064]
[null,null,null,null,"Castelló de Rugat",null,null,"Cirat","12046","Castelló","L'Alt Millars",201,"Sí","Vulnerabilitat residual","No","Baixa","Baixa","Normal","-","A",41.1]
[null,null,null,null,"Castellonet de la Conquesta",null,null,"Cortes de Arenoso","12048","Castelló","L'Alt Millars",318,"Sí","Polivulnerabilitat baixa","No","Baixa","Baixa","Normal","-","A",80.587000000000003]
[null,null,null,null,"Castielfabib",null,null,"Costur","12049","Castelló","L'Alcalatén",524,"No","Vulnerabilitat residual","No","Baixa","Baixa","Normal","-","A",21.93]
[null,null,null,null,"Castillo de Villamalefa",null,null,"Coves de Vinromà, les","12050","Castelló","La Plana Alta",1823,"Sí","Polivulnerabilitat mitjana","Sí","Mitjana","Baixa","Normal","-","A",136.43600000000001]
[null,null,null,null,"Catadau",null,null,"Culla","12051","Castelló","L'Alt Maestrat",495,"Sí","Polivulnerabilitat mitjana","No","Baixa","Baixa","Normal","-","A",115.85899999999999]
[null,null,null,null,"Catarroja",null,null,"Xert","12052","Castelló","El Baix Maestrat",701,"Sí","Polivulnerabilitat baixa","No","Baixa","Baixa","Normal","-","A",82.509]
[null,null,null,null,"Catí",null,null,"Xilxes","12053","Castelló","La Plana Baixa",2679,"No","Vulnerabilitat residual","No","Alta","Baixa","Normal","-","A",13.581]
[null,null,null,null,"Catral",null,null,"Xodos","12055","Castelló","L'Alcalatén",112,"Sí","Polivulnerabilitat baixa","No","Baixa","Baixa","Normal","-","A",44.265999999999998]
[null,null,null,null,"Caudete de las Fuentes",null,null,"Chóvar","12056","Castelló","L'Alt Palància",288,"Sí","Vulnerabilitat residual","No","Baixa","Baixa","Normal","-","A",18.309000000000001]
[null,null,null,null,"Caudiel",null,null,"Eslida","12057","Castelló","La Plana Baixa",759,"No","Polivulnerabilitat baixa","No","Alta","Baixa","Normal","-","A",18.125]
[null,null,null,null,"Cerdà",null,null,"Espadilla","12058","Castelló","L'Alt Millars",71,"Sí","Vulnerabilitat residual","No","Baixa","Baixa","Normal","-","A",11.964]
[null,null,null,null,"Cervera del Maestre",null,null,"Fanzara","12059","Castelló","L'Alt Millars",267,"Sí","Vulnerabilitat residual","No","Alta","Baixa","Normal","Mitjana","A",34.975999999999999]
[null,null,null,null,"Chella",null,null,"Figueroles","12060","Castelló","L'Alcalatén",523,"No","Vulnerabilitat residual","No","Baixa","Baixa","Normal","-","A",12.089]
[null,null,null,null,"Chelva",null,null,"Forcall","12061","Castelló","Els Ports",465,"Sí","Polivulnerabilitat mitjana","No","Mitjana","Baixa","Normal","-","A",39.206000000000003]
[null,null,null,null,"Chera",null,null,"Fuente la Reina","12063","Castelló","L'Alt Millars",52,"Sí","Vulnerabilitat residual","No","Baixa","Baixa","Normal","-","A",7.5]
[null,null,null,null,"Cheste",null,null,"Fuentes de Ayódar","12064","Castelló","L'Alt Millars",87,"Sí","Vulnerabilitat residual","No","Baixa","Baixa","Normal","-","A",10.983000000000001]
[null,null,null,null,"Chiva",null,null,"Gaibiel","12065","Castelló","L'Alt Palància",188,"Sí","Vulnerabilitat integral","Sí","Alta","Baixa","Normal","-","A",18.077999999999999]
[null,null,null,null,"Chóvar",null,null,"Geldo","12067","Castelló","L'Alt Palància",635,"Sí","Polivulnerabilitat mitjana","No","Mitjana","Baixa","Normal","-","A",0.56299999999999994]
[null,null,null,null,"Chulilla",null,null,"Herbés","12068","Castelló","Els Ports",42,"Sí","Polivulnerabilitat mitjana","No","Baixa","Baixa","Normal","-","A",27.117999999999999]
[null,null,null,null,"Cinctorres",null,null,"Higueras","12069","Castelló","L'Alt Palància",54,"Sí","Polivulnerabilitat baixa","No","Baixa","Baixa","Normal","-","A",11.843999999999999]
[null,null,null,null,"Cirat",null,null,"Jana, la","12070","Castelló","El Baix Maestrat",675,"No","Polivulnerabilitat mitjana","Sí","Mitjana","Baixa","Normal","Mitjana","A",19.501999999999999]
[null,null,null,null,"Cocentaina",null,null,"Jérica","12071","Castelló","L'Alt Palància",1548,"No","Vulnerabilitat residual","No","Mitjana","Baixa","Normal","-","A",78.275000000000006]
[null,null,null,null,"Cofrentes",null,null,"Llucena","12072","Castelló","L'Alcalatén",1302,"Sí","Polivulnerabilitat baixa","No","Baixa","Baixa","Normal","-","A",137.036]
[null,null,null,null,"Confrides",null,null,"Ludiente","12073","Castelló","L'Alt Millars",141,"Sí","Polivulnerabilitat baixa","No","Mitjana","Baixa","Normal","-","A",31.350999999999999]
[null,null,null,null,"Corbera",null,null,"Llosa, la","12074","Castelló","La Plana Baixa",951,"No","Polivulnerabilitat baixa","No","Mitjana","Baixa","Normal","-","A",10.032999999999999]
[null,null,null,null,"Cortes de Arenoso",null,null,"Mata de Morella, la","12075","Castelló","Els Ports",166,"Sí","Polivulnerabilitat mitjana","No","Mitjana","Baixa","Normal","-","A",15.161]
[null,null,null,null,"Cortes de Pallás",null,null,"Matet","12076","Castelló","L'Alt Palància",84,"Sí","Polivulnerabilitat mitjana","Sí","Mitjana","Baixa","Normal","-","A",14.888]
[null,null,null,null,"Costur",null,null,"Moncofa","12077","Castelló","La Plana Baixa",6525,"No","Vulnerabilitat residual","No","Alta","Baixa","Alt","Alta","C-2",14.529]
[null,null,null,null,"Cotes",null,null,"Montán","12078","Castelló","L'Alt Millars",370,"Sí","Polivulnerabilitat baixa","No","Baixa","Baixa","Normal","-","A",34.097000000000001]
[null,null,null,null,"Coves de Vinromà, les",null,null,"Montanejos","12079","Castelló","L'Alt Millars",572,"Sí","Vulnerabilitat residual","No","Mitjana","Baixa","Normal","Mitjana","A",37.799999999999997]
[null,null,null,null,"Cox",null,null,"Morella","12080","Castelló","Els Ports",2430,"Sí","Polivulnerabilitat mitjana","No","Baixa","Baixa","Normal","-","A",413.53899999999999]
[null,null,null,null,"Crevillent",null,null,"Navajas","12081","Castelló","L'Alt Palància",716,"No","Vulnerabilitat residual","No","Mitjana","Baixa","Normal","-","A",7.8879999999999999]
[null,null,null,null,"Culla",null,null,"Nules","12082","Castelló","La Plana Baixa",13103,"No","Polivulnerabilitat baixa","No","Alta","Baixa","Normal","Alta","C-1",50.533999999999999]
[null,null,null,null,"Cullera",null,null,"Olocau del Rey","12083","Castelló","Els Ports",119,"Sí","Polivulnerabilitat baixa","No","Baixa","Baixa","Normal","-","A",43.98]
[null,null,null,null,"Daimús",null,null,"Onda","12084","Castelló","La Plana Baixa",24859,"No","Polivulnerabilitat baixa","No","Mitjana","Baixa","Normal","Baixa","C-1",108.20099999999999]
[null,null,null,null,"Daya Nueva",null,null,"Orpesa","12085","Castelló","La Plana Alta",9076,"No","Polivulnerabilitat mitjana","No","Alta","Baixa","Normal","Mitjana","A",26.422000000000001]
[null,null,null,null,"Daya Vieja",null,null,"Palanques","12087","Castelló","Els Ports",30,"Sí","Polivulnerabilitat baixa","No","Baixa","Baixa","Normal","-","A",14.321]
[null,null,null,null,"Dénia",null,null,"Pavías","12088","Castelló","L'Alt Palància",61,"Sí","Vulnerabilitat residual","No","Baixa","Baixa","Normal","-","A",14.412000000000001]
[null,null,null,null,"Dolores",null,null,"Peníscola","12089","Castelló","El Baix Maestrat",7612,"No","Polivulnerabilitat mitjana","Sí","Alta","Baixa","Normal","Mitjana","A",78.974000000000004]
[null,null,null,null,"Domeño",null,null,"Pina de Montalgrao","12090","Castelló","L'Alt Palància",111,"Sí","Polivulnerabilitat baixa","No","Baixa","Baixa","Normal","-","A",31.603000000000002]
[null,null,null,null,"Dos Aguas",null,null,"Portell de Morella","12091","Castelló","Els Ports",197,"Sí","Polivulnerabilitat mitjana","No","Baixa","Baixa","Normal","-","A",49.395000000000003]
[null,null,null,null,"Elda",null,null,"Puebla de Arenoso","12092","Castelló","L'Alt Millars",158,"Sí","Polivulnerabilitat mitjana","Sí","Baixa","Baixa","Normal","-","A",42.529000000000003]
[null,null,null,null,"Eliana, l'",null,null,"Pobla de Benifassà, la","12093","Castelló","El Baix Maestrat",202,"Sí","Polivulnerabilitat baixa","No","Baixa","Baixa","Normal","-","A",135.999]
[null,null,null,null,"Elx",null,null,"Pobla Tornesa, la","12094","Castelló","La Plana Alta",1211,"No","Polivulnerabilitat baixa","No","Baixa","Baixa","Normal","-","A",25.690999999999999]
[null,null,null,null,"Emperador",null,null,"Ribesalbes","12095","Castelló","La Plana Baixa",1174,"No","Polivulnerabilitat baixa","No","Mitjana","Baixa","Normal","Mitjana","A",8.5399999999999991]
[null,null,null,null,"Enguera",null,null,"Rossell","12096","Castelló","El Baix Maestrat",937,"Sí","Vulnerabilitat residual","No","Mitjana","Baixa","Normal","-","A",74.926000000000002]
[null,null,null,null,"Énova, l'",null,null,"Sacañet","12097","Castelló","L'Alt Palància",67,"Sí","Vulnerabilitat residual","No","Baixa","Baixa","Normal","-","A",30.495999999999999]
[null,null,null,null,"Eslida",null,null,"Salzadella, la","12098","Castelló","El Baix Maestrat",704,"Sí","Polivulnerabilitat baixa","No","Baixa","Baixa","Normal","-","A",49.92]
[null,null,null,null,"Espadilla",null,null,"Sant Jordi","12099","Castelló","El Baix Maestrat",972,"No","Vulnerabilitat residual","No","Mitjana","Baixa","Normal","-","A",36.494]
[null,null,null,null,"Estivella",null,null,"Sant Mateu","12100","Castelló","El Baix Maestrat",1963,"No","Polivulnerabilitat baixa","No","Mitjana","Baixa","Normal","Baixa","A",64.623999999999995]
[null,null,null,null,"Estubeny",null,null,"San Rafael del Río","12101","Castelló","El Baix Maestrat",469,"Sí","Polivulnerabilitat mitjana","Sí","Baixa","Baixa","Normal","-","A",21.151]
[null,null,null,null,"Facheca",null,null,"Santa Magdalena de Pulpis","12102","Castelló","El Baix Maestrat",768,"No","Polivulnerabilitat baixa","No","Alta","Baixa","Normal","Mitjana","A",66.484999999999999]
[null,null,null,null,"Famorca",null,null,"Serratella, la","12103","Castelló","La Plana Alta",101,"Sí","Polivulnerabilitat mitjana","No","Baixa","Baixa","Normal","-","A",18.812000000000001]
[null,null,null,null,"Fanzara",null,null,"Segorbe","12104","Castelló","L'Alt Palància",8978,"No","Vulnerabilitat residual","No","Mitjana","Baixa","Normal","-","C-2",106.08]
[null,null,null,null,"Faura",null,null,"Sierra Engarcerán","12105","Castelló","La Plana Alta",976,"Sí","Polivulnerabilitat baixa","No","Mitjana","Baixa","Normal","-","A",81.98]
[null,null,null,null,"Favara",null,null,"Soneja","12106","Castelló","L'Alt Palància",1447,"No","Vulnerabilitat residual","No","Baixa","Baixa","Normal","-","A",29.105]
[null,null,null,null,"Figueroles",null,null,"Sot de Ferrer","12107","Castelló","L'Alt Palància",415,"No","Vulnerabilitat residual","No","Mitjana","Baixa","Normal","-","A",8.64]
[null,null,null,null,"Finestrat",null,null,"Suera","12108","Castelló","La Plana Baixa",525,"No","Vulnerabilitat residual","No","Baixa","Baixa","Normal","-","A",22.22]
[null,null,null,null,"Foios",null,null,"Tales","12109","Castelló","La Plana Baixa",825,"No","Vulnerabilitat residual","No","Mitjana","Baixa","Alt","-","A",14.525]
[null,null,null,null,"Fondó de les Neus, el",null,null,"Teresa","12110","Castelló","L'Alt Palància",242,"Sí","Polivulnerabilitat baixa","No","Mitjana","Baixa","Normal","-","A",19.885999999999999]
[null,null,null,null,"Font de la Figuera, la",null,null,"Tírig","12111","Castelló","L'Alt Maestrat",419,"Sí","Polivulnerabilitat baixa","No","Mitjana","Baixa","Normal","-","A",42.335999999999999]
[null,null,null,null,"Font d'En Carròs, la",null,null,"Todolella","12112","Castelló","Els Ports",155,"Sí","Vulnerabilitat residual","No","Baixa","Baixa","Normal","-","A",34.024999999999999]
[null,null,null,null,"Fontanars dels Alforins",null,null,"Toga","12113","Castelló","L'Alt Millars",100,"Sí","Vulnerabilitat residual","No","Baixa","Baixa","Normal","-","A",13.523999999999999]
[null,null,null,null,"Forcall",null,null,"Torás","12114","Castelló","L'Alt Palància",223,"Sí","Vulnerabilitat residual","No","Baixa","Baixa","Normal","-","A",16.783999999999999]
[null,null,null,null,"Formentera del Segura",null,null,"Toro, El","12115","Castelló","L'Alt Palància",256,"Sí","Polivulnerabilitat mitjana","Sí","Baixa","Baixa","Normal","-","A",109.95099999999999]
[null,null,null,null,"Fortaleny",null,null,"Torralba del Pinar","12116","Castelló","L'Alt Millars",69,"Sí","Vulnerabilitat residual","No","Baixa","Baixa","Normal","-","A",21.193000000000001]
[null,null,null,null,"Fuente la Reina",null,null,"Torreblanca","12117","Castelló","La Plana Alta",5528,"No","Polivulnerabilitat mitjana","Sí","Alta","Baixa","Normal","Baixa","A",29.814]
[null,null,null,null,"Fuenterrobles",null,null,"Torrechiva","12118","Castelló","L'Alt Millars",81,"Sí","Vulnerabilitat residual","No","Baixa","Baixa","Normal","-","A",11.848000000000001]
[null,null,null,null,"Fuentes de Ayódar",null,null,"Torre d'En Besora, la","12119","Castelló","L'Alt Maestrat",158,"Sí","Polivulnerabilitat baixa","No","Baixa","Baixa","Normal","-","A",12.31]
[null,null,null,null,"Gaianes",null,null,"Torre d'en Doménec, la","12120","Castelló","La Plana Alta",180,"Sí","Polivulnerabilitat baixa","No","Baixa","Baixa","Normal","-","A",3.1859999999999999]
[null,null,null,null,"Gaibiel",null,null,"Traiguera","12121","Castelló","El Baix Maestrat",1378,"No","Polivulnerabilitat baixa","No","Baixa","Baixa","Normal","-","A",59.758000000000003]
[null,null,null,null,"Gandia",null,null,"Useres, les","12122","Castelló","L'Alcalatén",962,{"$error":"#N/A"},"Polivulnerabilitat baixa","No","Mitjana","Baixa","Normal","-","A",80.686000000000007]
[null,null,null,null,"Gata de Gorgos",null,null,"Vallat","12123","Castelló","L'Alt Millars",49,"Sí","Vulnerabilitat residual","No","Alta","Baixa","Normal","-","A",5.0049999999999999]
[null,null,null,null,"Gátova",null,null,"Vall d'Alba","12124","Castelló","La Plana Alta",2807,"No","Polivulnerabilitat baixa","No","Mitjana","Baixa","Normal","Baixa","A",52.915999999999997]
[null,null,null,null,"Gavarda",null,null,"Vall de Almonacid","12125","Castelló","L'Alt Palància",269,"Sí","Vulnerabilitat residual","No","Baixa","Baixa","Normal","-","A",21.12]
[null,null,null,null,"Geldo",null,null,"Vall d'Uixó, la","12126","Castelló","La Plana Baixa",31660,"No","Vulnerabilitat residual","No","Mitjana","Baixa","Normal","Alta","C-1",67.081000000000003]
[null,null,null,null,"Genovés, el",null,null,"Vallibona","12127","Castelló","Els Ports",69,"Sí","Vulnerabilitat residual","No","Baixa","Baixa","Normal","-","A",91.370999999999995]
[null,null,null,null,"Gestalgar",null,null,"Vilafamés","12128","Castelló","La Plana Alta",1842,"No","Vulnerabilitat residual","No","Mitjana","Baixa","Normal","-","A",70.545000000000002]
[null,null,null,null,"Gilet",null,null,"Vilafranca","12129","Castelló","L'Alt Maestrat",2200,{"$error":"#N/A"},"Polivulnerabilitat baixa","No","Baixa","Baixa","Normal","-","A",93.844999999999999]
[null,null,null,null,"Godella",null,null,"Villahermosa del Río","12130","Castelló","L'Alt Millars",489,"Sí","Polivulnerabilitat baixa","No","Mitjana","Baixa","Normal","-","A",108.88500000000001]
[null,null,null,null,"Godelleta",null,null,"Villamalur","12131","Castelló","L'Alt Millars",62,"Sí","Polivulnerabilitat baixa","No","Baixa","Baixa","Normal","-","A",19.475000000000001]
[null,null,null,null,"Gorga",null,null,"Vilanova d'Alcolea","12132","Castelló","La Plana Alta",584,"Sí","Polivulnerabilitat baixa","No","Baixa","Baixa","Normal","-","A",68.409000000000006]
[null,null,null,null,"Granja de la Costera, la",null,null,"Villanueva de Viver","12133","Castelló","L'Alt Millars",61,"Sí","Polivulnerabilitat baixa","No","Baixa","Baixa","Normal","-","A",5.9470000000000001]
[null,null,null,null,"Granja de Rocamora",null,null,"Vilar de Canes","12134","Castelló","L'Alt Maestrat",169,"Sí","Polivulnerabilitat mitjana","No","Baixa","Baixa","Normal","-","A",15.91]
[null,null,null,null,"Guadasséquies",null,null,"Vila-real","12135","Castelló","La Plana Baixa",50893,"No","Vulnerabilitat residual","No","Mitjana","Baixa","Alt","Alta","B",55.122999999999998]
[null,null,null,null,"Guadassuar",null,null,"Vilavella, la","12136","Castelló","La Plana Baixa",3157,"No","Polivulnerabilitat baixa","No","Baixa","Baixa","Alt","Baixa","A",6.1459999999999999]
[null,null,null,null,"Guardamar de la Safor",null,null,"Villores","12137","Castelló","Els Ports",39,"Sí","Polivulnerabilitat baixa","No","Mitjana","Baixa","Normal","-","A",5.3049999999999997]
[null,null,null,null,"Guardamar del Segura",null,null,"Vinaròs","12138","Castelló","El Baix Maestrat",28682,"No","Polivulnerabilitat mitjana","Sí","Alta","Baixa","Alt","Alta","C-1",95.454999999999998]
[null,null,null,null,"Herbés",null,null,"Vistabella del Maestrat","12139","Castelló","L'Alcalatén",339,"Sí","Polivulnerabilitat baixa","No","Baixa","Baixa","Normal","-","A",150.995]
[null,null,null,null,"Higueras",null,null,"Viver","12140","Castelló","L'Alt Palància",1536,"No","Vulnerabilitat residual","No","Alta","Baixa","Normal","-","A",49.926000000000002]
[null,null,null,null,"Higueruelas",null,null,"Zorita del Maestrazgo","12141","Castelló","Els Ports",114,"Sí","Polivulnerabilitat baixa","No","Baixa","Baixa","Normal","-","A",68.832999999999998]
[null,null,null,null,"Hondón de los Frailes",null,null,"Zucaina","12142","Castelló","L'Alt Millars",171,"Sí","Polivulnerabilitat mitjana","No","Baixa","Baixa","Normal","-","A",51.57]
[null,null,null,null,"Ibi",null,null,"Alqueries, les","12901","Castelló","La Plana Baixa",4449,"No","Polivulnerabilitat baixa","No","Mitjana","Baixa","Normal","Baixa","C-1",12.61]
[null,null,null,null,"Jacarilla",null,null,"Sant Joan de Moró","12902","Castelló","La Plana Alta",3159,"No","Polivulnerabilitat baixa","No","Baixa","Baixa","Normal","Baixa","A",28.664000000000001]
[null,null,null,null,"Jalance",null,null,"Ademuz","46001","València","El Racó d'Ademús",1042,"Sí","Polivulnerabilitat mitjana","Sí","Mitjana","Baixa","Normal","Mitjana","A",100.41800000000001]
[null,null,null,null,"Jana, la",null,null,"Ador","46002","València","La Safor",1508,"No","Vulnerabilitat residual","No","Alta","Alta","Normal","-","A",13.811999999999999]
[null,null,null,null,"Jarafuel",null,null,"Atzeneta d'Albaida","46003","València","La Vall d'Albaida",1165,"No","Polivulnerabilitat baixa","No","Baixa","Mitjana","Normal","-","A",6.056]
[null,null,null,null,"Jérica",null,null,"Agullent","46004","València","La Vall d'Albaida",2410,"No","Polivulnerabilitat baixa","No","Baixa","Alta","Normal","Baixa","A",16.239000000000001]
[null,null,null,null,"Llanera de Ranes",null,null,"Alaquàs","46005","València","L'Horta Oest",29561,"No","Polivulnerabilitat baixa","No","Alta","Mitjana","Alt","Alta","C-1",3.9020000000000001]
[null,null,null,null,"Llaurí",null,null,"Albaida","46006","València","La Vall d'Albaida",5900,"No","Polivulnerabilitat baixa","No","Mitjana","Alta","Normal","-","A",35.414000000000001]
[null,null,null,null,"Llíber",null,null,"Albal","46007","València","L'Horta Sud",16399,"No","Polivulnerabilitat baixa","No","Alta","Mitjana","Alt","Alta","C-1",7.3319999999999999]
[null,null,null,null,"Llíria",null,null,"Albalat de la Ribera","46008","València","La Ribera Baixa",3360,"No","Polivulnerabilitat mitjana","Sí","Alta","Alta","Normal","Mitjana","A",14.35]
[null,null,null,null,"Llocnou de la Corona",null,null,"Albalat dels Sorells","46009","València","L'Horta Nord",3977,"No","Polivulnerabilitat baixa","No","Baixa","Mitjana","Alt","Baixa","C-2",4.625]
[null,null,null,null,"Llocnou de Sant Jeroni",null,null,"Albalat dels Tarongers","46010","València","El Camp de Morvedre",1232,"No","Vulnerabilitat residual","No","Baixa","Baixa","Normal","-","A",21.344999999999999]
[null,null,null,null,"Llocnou d'en Fenollet",null,null,"Alberic","46011","València","La Ribera Alta",10526,"No","Polivulnerabilitat mitjana","Sí","Mitjana","Alta","Normal","Alta","A",26.792000000000002]
[null,null,null,null,"Llombai",null,null,"Alborache","46012","València","La Foia de Bunyol",1160,"No","Vulnerabilitat residual","No","Mitjana","Mitjana","Normal","Baixa","A",27.331]
[null,null,null,null,"Llosa de Ranes, la",null,null,"Alboraia","46013","València","L'Horta Nord",24454,"No","Vulnerabilitat residual","No","Alta","Mitjana","Alt","Mitjana","B",8.34]
[null,null,null,null,"Llosa, la",null,null,"Albuixech","46014","València","L'Horta Nord",4017,"No","Polivulnerabilitat baixa","No","Baixa","Mitjana","Alt","Mitjana","C-2",4.4189999999999996]
[null,null,null,null,"Llucena",null,null,"Alcàsser","46015","València","L'Horta Sud",10039,"No","Polivulnerabilitat baixa","No","Alta","Mitjana","Alt","Baixa","C-1",9.0039999999999996]
[null,null,null,null,"Llutxent",null,null,"Alcàntera de Xúquer","46016","València","La Ribera Alta",1291,"No","Polivulnerabilitat baixa","No","Alta","Alta","Normal","-","A",3.3250000000000002]
[null,null,null,null,"Loriguilla",null,null,"Alzira","46017","València","La Ribera Alta",44352,"No","Vulnerabilitat residual","No","Alta","Alta","Alt","Alta","C-1",110.49]
[null,null,null,null,"Losa del Obispo",null,null,"Alcublas","46018","València","Els Serrans",628,"Sí","Vulnerabilitat residual","No","Baixa","Baixa","Normal","Mitjana","A",43.512]
[null,null,null,null,"Ludiente",null,null,"Alcúdia, l'","46019","València","La Ribera Alta",12009,"No","Vulnerabilitat residual","No","Alta","Alta","Normal","Alta","A",23.667000000000002]
[null,null,null,null,"Macastre",null,null,"Alcúdia de Crespins, l'","46020","València","La Costera",5157,"No","Polivulnerabilitat baixa","No","Alta","Alta","Normal","Alta","A",5.1680000000000001]
[null,null,null,null,"Manises",null,null,"Aldaia","46021","València","L'Horta Oest",31864,"No","Polivulnerabilitat baixa","No","Alta","Mitjana","Alt","Alta","C-1",16.050999999999998]
[null,null,null,null,"Manuel",null,null,"Alfafar","46022","València","L'Horta Sud",20890,"No","Polivulnerabilitat mitjana","Sí","Alta","Mitjana","Alt","Alta","C-1",10.041]
[null,null,null,null,"Marines",null,null,"Alfauir","46023","València","La Safor",437,"No","Vulnerabilitat residual","No","Alta","Mitjana","Normal","Alta","A",6.22]
[null,null,null,null,"Massalavés",null,null,"Alfara de la Baronia","46024","València","El Camp de Morvedre",557,"No","Vulnerabilitat residual","No","Baixa","Baixa","Normal","-","A",11.71]
[null,null,null,null,"Massalfassar",null,null,"Alfara del Patriarca","46025","València","L'Horta Nord",3310,"No","Vulnerabilitat residual","No","Alta","Mitjana","Alt","Mitjana","C-2",1.9810000000000001]
[null,null,null,null,"Massamagrell",null,null,"Alfarp","46026","València","La Ribera Alta",1544,"No","Vulnerabilitat residual","No","Mitjana","Mitjana","Normal","-","A",20.577999999999999]
[null,null,null,null,"Massanassa",null,null,"Alfarrasí","46027","València","La Vall d'Albaida",1225,"No","Polivulnerabilitat baixa","No","Baixa","Alta","Normal","Baixa","A",6.38]
[null,null,null,null,"Mata de Morella, la",null,null,"Algar de Palancia","46028","València","El Camp de Morvedre",481,"No","Vulnerabilitat residual","No","Baixa","Baixa","Normal","-","A",13.151]
[null,null,null,null,"Matet",null,null,"Algemesí","46029","València","La Ribera Alta",27331,"No","Polivulnerabilitat baixa","No","Alta","Alta","Normal","Alta","C-1",41.3]
[null,null,null,null,"Meliana",null,null,"Algímia d'Alfara","46030","València","El Camp de Morvedre",1011,"No","Polivulnerabilitat mitjana","Sí","Mitjana","Baixa","Normal","-","A",14.452999999999999]
[null,null,null,null,"Millares",null,null,"Alginet","46031","València","La Ribera Alta",13380,"No","Polivulnerabilitat baixa","No","Alta","Mitjana","Normal","Mitjana","A",24.071999999999999]
[null,null,null,null,"Millena",null,null,"Almàssera","46032","València","L'Horta Nord",7349,"No","Polivulnerabilitat baixa","No","Baixa","Mitjana","Alt","Mitjana","C-1",2.7389999999999999]
[null,null,null,null,"Miramar",null,null,"Almiserà","46033","València","La Safor",262,"No","Polivulnerabilitat baixa","No","Mitjana","Mitjana","Normal","Alta","A",7.44]
[null,null,null,null,"Mislata",null,null,"Almoines","46034","València","La Safor",2414,"No","Vulnerabilitat residual","No","Alta","Alta","Normal","Baixa","A",2.1179999999999999]
[null,null,null,null,"Moixent",null,null,"Almussafes","46035","València","La Ribera Baixa",8967,"No","Vulnerabilitat residual","No","Baixa","Mitjana","Alt","Mitjana","A",10.762]
[null,null,null,null,"Moncada",null,null,"Alpuente","46036","València","Els Serrans",633,"Sí","Vulnerabilitat integral","Sí","Mitjana","Baixa","Normal","Mitjana","A",138.33000000000001]
[null,null,null,null,"Moncofa",null,null,"Alqueria de la Comtessa, l'","46037","València","La Safor",1476,"No","Vulnerabilitat residual","No","Alta","Alta","Normal","Baixa","A",2.153]
[null,null,null,null,"Monforte del Cid",null,null,"Andilla","46038","València","Els Serrans",319,"Sí","Polivulnerabilitat baixa","No","Alta","Baixa","Normal","-","A",142.77799999999999]
[null,null,null,null,"Monòver",null,null,"Anna","46039","València","La Canal de Navarrés",2628,"No","Polivulnerabilitat mitjana","No","Mitjana","Mitjana","Normal","-","A",21.449000000000002]
[null,null,null,null,"Montán",null,null,"Antella","46040","València","La Ribera Alta",1175,"No","Vulnerabilitat residual","No","Alta","Alta","Normal","-","A",17.579000000000001]
[null,null,null,null,"Montanejos",null,null,"Aras de los Olmos","46041","València","Els Serrans",381,"Sí","Polivulnerabilitat mitjana","Sí","Mitjana","Mitjana","Normal","-","A",76.037000000000006]
[null,null,null,null,"Montaverner",null,null,"Aielo de Malferit","46042","València","La Vall d'Albaida",4618,"No","Polivulnerabilitat baixa","No","Baixa","Alta","Normal","Baixa","A",26.739000000000001]
[null,null,null,null,"Montesa",null,null,"Aielo de Rugat","46043","València","La Vall d'Albaida",155,"Sí","Vulnerabilitat residual","No","Baixa","Alta","Normal","-","A",7.8310000000000004]
[null,null,null,null,"Montesinos, Los",null,null,"Ayora","46044","València","La Vall de Cofrents-Aiora",5312,"Sí","Polivulnerabilitat baixa","No","Alta","Mitjana","Normal","Mitjana","A",446.57900000000001]
[null,null,null,null,"Montitxelvo",null,null,"Barxeta","46045","València","La Costera",1601,"No","Polivulnerabilitat baixa","No","Mitjana","Mitjana","Normal","-","A",28.518000000000001]
[null,null,null,null,"Montroi",null,null,"Barx","46046","València","La Safor",1277,"No","Polivulnerabilitat baixa","No","Alta","Mitjana","Normal","Mitjana","A",16.103000000000002]
[null,null,null,null,"Montserrat",null,null,"Bèlgida","46047","València","La Vall d'Albaida",673,"No","Vulnerabilitat residual","No","Baixa","Alta","Normal","-","A",17.262]
[null,null,null,null,"Morella",null,null,"Bellreguard","46048","València","La Safor",4608,"No","Vulnerabilitat residual","No","Alta","Alta","Alt","Mitjana","A",2.8519999999999999]
[null,null,null,null,"Murla",null,null,"Bellús","46049","València","La Vall d'Albaida",304,"No","Polivulnerabilitat mitjana","Sí","Baixa","Alta","Normal","-","A",9.5399999999999991]
[null,null,null,null,"Muro de Alcoy",null,null,"Benagéber","46050","València","Els Serrans",192,"Sí","Polivulnerabilitat baixa","No","Baixa","Baixa","Normal","Alta","A",69.823999999999998]
[null,null,null,null,"Museros",null,null,"Benaguasil","46051","València","El Camp de Túria",10988,"No","Polivulnerabilitat baixa","No","Baixa","Mitjana","Normal","Alta","C-2",25.396000000000001]
[null,null,null,null,"Mutxamel",null,null,"Benavites","46052","València","El Camp de Morvedre",619,"No","Vulnerabilitat residual","No","Mitjana","Baixa","Normal","Mitjana","A",4.2699999999999996]
[null,null,null,null,"Nàquera",null,null,"Beneixida","46053","València","La Ribera Alta",651,"No","Vulnerabilitat residual","No","Baixa","Mitjana","Normal","-","A",3.1960000000000002]
[null,null,null,null,"Navajas",null,null,"Benetússer","46054","València","L'Horta Sud",14799,"No","Polivulnerabilitat baixa","No","Alta","Mitjana","Alt","Mitjana","C-1",0.77900000000000003]
[null,null,null,null,"Navarrés",null,null,"Beniarjó","46055","València","La Safor",1765,"No","Polivulnerabilitat baixa","No","Alta","Alta","Normal","Alta","A",2.7509999999999999]
[null,null,null,null,"Novelda",null,null,"Beniatjar","46056","València","La Vall d'Albaida",223,"Sí","Polivulnerabilitat baixa","No","Baixa","Alta","Normal","-","A",11.371]
[null,null,null,null,"Novetlè",null,null,"Benicolet","46057","València","La Vall d'Albaida",569,"No","Polivulnerabilitat baixa","No","Mitjana","Mitjana","Normal","Mitjana","A",11.291]
[null,null,null,null,"Nucia, la",null,null,"Benifairó de les Valls","46058","València","El Camp de Morvedre",2186,"No","Vulnerabilitat residual","No","Mitjana","Baixa","Normal","-","A",4.3449999999999998]
[null,null,null,null,"Nules",null,null,"Benifairó de la Valldigna","46059","València","La Safor",1571,"No","Polivulnerabilitat baixa","No","Mitjana","Alta","Normal","-","A",20.199000000000002]
[null,null,null,null,"Oliva",null,null,"Benifaió","46060","València","La Ribera Alta",11962,"No","Vulnerabilitat residual","No","Baixa","Mitjana","Normal","Mitjana","A",20.154]
[null,null,null,null,"Olleria, l'",null,null,"Beniflá","46061","València","La Safor",457,"No","Polivulnerabilitat baixa","No","Baixa","Alta","Normal","-","A",0.625]
[null,null,null,null,"Olocau",null,null,"Benigànim","46062","València","La Vall d'Albaida",5841,"No","Polivulnerabilitat baixa","No","Baixa","Alta","Normal","-","A",33.439]
[null,null,null,null,"Olocau del Rey",null,null,"Benimodo","46063","València","La Ribera Alta",2268,"No","Polivulnerabilitat baixa","No","Baixa","Alta","Normal","-","A",12.522]
[null,null,null,null,"Onda",null,null,"Benimuslem","46064","València","La Ribera Alta",653,"No","Polivulnerabilitat baixa","No","Alta","Alta","Normal","Alta","A",4.17]
[null,null,null,null,"Ondara",null,null,"Beniparrell","46065","València","L'Horta Sud",1952,"No","Vulnerabilitat residual","No","Alta","Mitjana","Alt","Baixa","C-1",3.6179999999999999]
[null,null,null,null,"Onil",null,null,"Benirredrà","46066","València","La Safor",1592,"No","Polivulnerabilitat baixa","No","Alta","Mitjana","Alt","Baixa","A",0.38900000000000001]
[null,null,null,null,"Ontinyent",null,null,"Benissanó","46067","València","El Camp de Túria",2260,"No","Polivulnerabilitat baixa","No","Baixa","Baixa","Normal","Mitjana","A",2.2850000000000001]
[null,null,null,null,"Orba",null,null,"Benissoda","46068","València","La Vall d'Albaida",430,"No","Polivulnerabilitat baixa","No","Baixa","Mitjana","Normal","-","A",4.04]
[null,null,null,null,"Orihuela",null,null,"Benissuera","46069","València","La Vall d'Albaida",194,"No","Polivulnerabilitat baixa","No","Mitjana","Alta","Normal","-","A",2.1190000000000002]
[null,null,null,null,"Orpesa",null,null,"Bétera","46070","València","El Camp de Túria",24272,"No","Vulnerabilitat residual","No","Mitjana","Mitjana","Alt","Alta","C-2",75.096000000000004]
[null,null,null,null,"Orxa, l'",null,null,"Bicorp","46071","València","La Canal de Navarrés",533,"Sí","Polivulnerabilitat mitjana","Sí","Mitjana","Alta","Normal","-","A",136.50399999999999]
[null,null,null,null,"Orxeta",null,null,"Bocairent","46072","València","La Vall d'Albaida",4195,"No","Vulnerabilitat residual","No","Mitjana","Alta","Normal","Mitjana","A",96.980999999999995]
[null,null,null,null,"Otos",null,null,"Bolbaite","46073","València","La Canal de Navarrés",1356,"No","Polivulnerabilitat mitjana","No","Alta","Mitjana","Normal","-","A",40.387]
[null,null,null,null,"Paiporta",null,null,"Bonrepòs i Mirambell","46074","València","L'Horta Nord",3691,"No","Polivulnerabilitat baixa","No","Mitjana","Mitjana","Alt","Alta","C-2",1.0549999999999999]
[null,null,null,null,"Palanques",null,null,"Bufali","46075","València","La Vall d'Albaida",161,"No","Polivulnerabilitat baixa","No","Baixa","Alta","Normal","-","A",3.1920000000000002]
[null,null,null,null,"Palma de Gandía",null,null,"Bugarra","46076","València","Els Serrans",727,"Sí","Polivulnerabilitat mitjana","No","Mitjana","Baixa","Normal","-","A",40.308]
[null,null,null,null,"Palmera",null,null,"Buñol","46077","València","La Foia de Bunyol",9408,"No","Polivulnerabilitat mitjana","Sí","Mitjana","Mitjana","Normal","Baixa","A",112.40300000000001]
[null,null,null,null,"Palomar, el",null,null,"Burjassot","46078","València","L'Horta Nord",38024,"No","Vulnerabilitat integral","Sí","Mitjana","Mitjana","Alt","Alta","C-1",3.444]
[null,null,null,null,"Parcent",null,null,"Calles","46079","València","Els Serrans",355,"Sí","Polivulnerabilitat mitjana","No","Alta","Mitjana","Normal","-","A",64.921999999999997]
[null,null,null,null,"Paterna",null,null,"Camporrobles","46080","València","La Plana d'Utiel-Requena",1191,"Sí","Polivulnerabilitat baixa","No","Mitjana","Baixa","Normal","-","A",89.497]
[null,null,null,null,"Pavías",null,null,"Canals","46081","València","La Costera",13587,"No","Polivulnerabilitat baixa","No","Mitjana","Alta","Normal","Mitjana","A",21.86]
[null,null,null,null,"Pedralba",null,null,"Canet d'en Berenguer","46082","València","El Camp de Morvedre",6697,"No","Vulnerabilitat residual","No","Alta","Baixa","Alt","Mitjana","A",3.843]
[null,null,null,null,"Pedreguer",null,null,"Carcaixent","46083","València","La Ribera Alta",20358,"No","Polivulnerabilitat baixa","No","Alta","Alta","Normal","Alta","C-2",59.255000000000003]
[null,null,null,null,"Pego",null,null,"Càrcer","46084","València","La Ribera Alta",1862,"No","Polivulnerabilitat baixa","No","Alta","Alta","Normal","Alta","A",7.4050000000000002]
[null,null,null,null,"Penàguila",null,null,"Carlet","46085","València","La Ribera Alta",15598,"No","Polivulnerabilitat mitjana","Sí","Alta","Alta","Normal","Alta","A",45.622]
[null,null,null,null,"Peníscola",null,null,"Carrícola","46086","València","La Vall d'Albaida",94,"Sí","Polivulnerabilitat baixa","No","Baixa","Mitjana","Normal","-","A",4.5990000000000002]
[null,null,null,null,"Petrer",null,null,"Casas Altas","46087","València","El Racó d'Ademús",131,"Sí","Polivulnerabilitat mitjana","No","Baixa","Mitjana","Normal","-","A",15.951000000000001]
[null,null,null,null,"Petrés",null,null,"Casas Bajas","46088","València","El Racó d'Ademús",164,"Sí","Polivulnerabilitat baixa","No","Mitjana","Baixa","Normal","Alta","A",22.652999999999999]
[null,null,null,null,"Picanya",null,null,"Casinos","46089","València","El Camp de Túria",2777,"No","Polivulnerabilitat baixa","No","Mitjana","Baixa","Normal","-","A",41.484000000000002]
[null,null,null,null,"Picassent",null,null,"Castelló de Rugat","46090","València","La Vall d'Albaida",2274,"No","Polivulnerabilitat baixa","No","Baixa","Mitjana","Normal","-","A",19.021999999999998]
[null,null,null,null,"Pilar de la Horadada",null,null,"Castellonet de la Conquesta","46091","València","La Safor",147,"No","Vulnerabilitat residual","No","Baixa","Alta","Normal","-","A",5.4329999999999998]
[null,null,null,null,"Piles",null,null,"Castielfabib","46092","València","El Racó d'Ademús",317,"Sí","Vulnerabilitat integral","Sí","Baixa","Baixa","Normal","-","A",106.28700000000001]
[null,null,null,null,"Pina de Montalgrao",null,null,"Catadau","46093","València","La Ribera Alta",2777,"No","Vulnerabilitat residual","No","Alta","Mitjana","Normal","-","A",35.457999999999998]
[null,null,null,null,"Pinet",null,null,"Catarroja","46094","València","L'Horta Sud",28120,"No","Polivulnerabilitat baixa","No","Alta","Mitjana","Alt","Mitjana","C-1",13.157]
[null,null,null,null,"Pinós, el",null,null,"Caudete de las Fuentes","46095","València","La Plana d'Utiel-Requena",700,"No","Vulnerabilitat integral","Sí","Mitjana","Baixa","Normal","-","A",34.598999999999997]
[null,null,null,null,"Planes",null,null,"Cerdà","46096","València","La Costera",331,"No","Polivulnerabilitat baixa","No","Baixa","Alta","Normal","-","A",1.522]
[null,null,null,null,"Pobla de Benifassà, la",null,null,"Cofrentes","46097","València","La Vall de Cofrents-Aiora",1130,"Sí","Vulnerabilitat residual","No","Mitjana","Mitjana","Normal","-","A",103.184]
[null,null,null,null,"Pobla de Farnals, la",null,null,"Corbera","46098","València","La Ribera Baixa",3100,"No","Polivulnerabilitat mitjana","Sí","Alta","Alta","Normal","Baixa","A",20.27]
[null,null,null,null,"Pobla de Vallbona, la",null,null,"Cortes de Pallás","46099","València","La Vall de Cofrents-Aiora",814,"Sí","Polivulnerabilitat baixa","No","Mitjana","Mitjana","Normal","-","A",233.01300000000001]
[null,null,null,null,"Pobla del Duc, la",null,null,"Cotes","46100","València","La Ribera Alta",333,"No","Polivulnerabilitat baixa","No","Alta","Alta","Normal","-","A",6.3259999999999996]
[null,null,null,null,"Pobla Llarga, la",null,null,"Quart de les Valls","46101","València","El Camp de Morvedre",988,"No","Polivulnerabilitat mitjana","Sí","Mitjana","Baixa","Normal","-","A",8.4269999999999996]
[null,null,null,null,"Pobla Tornesa, la",null,null,"Quart de Poblet","46102","València","L'Horta Oest",24760,"No","Polivulnerabilitat mitjana","Sí","Mitjana","Mitjana","Alt","Alta","B",19.722000000000001]
[null,null,null,null,"Poble Nou de Benitatxell, el",null,null,"Quartell","46103","València","El Camp de Morvedre",1636,"No","Polivulnerabilitat baixa","No","Alta","Baixa","Normal","-","A",3.1779999999999999]
[null,null,null,null,"Poblets, els",null,null,"Quatretonda","46104","València","La Vall d'Albaida",2212,"No","Vulnerabilitat residual","No","Alta","Alta","Normal","Alta","A",43.548999999999999]
[null,null,null,null,"Polinyà de Xúquer",null,null,"Cullera","46105","València","La Ribera Baixa",22145,"No","Polivulnerabilitat baixa","No","Alta","Alta","Alt","Mitjana","C-1",53.820999999999998]
[null,null,null,null,"Polop",null,null,"Chelva","46106","València","Els Serrans",1489,"Sí","Polivulnerabilitat mitjana","Sí","Mitjana","Mitjana","Normal","-","A",190.38200000000001]
[null,null,null,null,"Portell de Morella",null,null,"Chella","46107","València","La Canal de Navarrés",2435,"No","Vulnerabilitat integral","Sí","Mitjana","Alta","Normal","-","A",43.491999999999997]
[null,null,null,null,"Potries",null,null,"Chera","46108","València","La Plana d'Utiel-Requena",474,"Sí","Polivulnerabilitat mitjana","Sí","Mitjana","Baixa","Normal","-","A",49.697000000000003]
[null,null,null,null,"Puçol",null,null,"Cheste","46109","València","La Foia de Bunyol",8494,"No","Vulnerabilitat residual","No","Mitjana","Mitjana","Normal","Baixa","A",71.441999999999993]
[null,null,null,null,"Puebla de Arenoso",null,null,"Xirivella","46110","València","L'Horta Oest",29623,"No","Vulnerabilitat integral","Sí","Mitjana","Mitjana","Alt","Alta","B",5.13]
[null,null,null,null,"Puebla de San Miguel",null,null,"Chiva","46111","València","La Foia de Bunyol",15123,"No","Vulnerabilitat residual","No","Mitjana","Baixa","Normal","Mitjana","A",178.72900000000001]
[null,null,null,null,"Puig de Santa Maria, el",null,null,"Chulilla","46112","València","Els Serrans",665,"Sí","Polivulnerabilitat mitjana","No","Mitjana","Mitjana","Normal","-","A",61.78]
[null,null,null,null,"Quart de les Valls",null,null,"Daimús","46113","València","La Safor",3117,"No","Vulnerabilitat residual","No","Alta","Alta","Alt","Baixa","A",3.1459999999999999]
[null,null,null,null,"Quart de Poblet",null,null,"Domeño","46114","València","Els Serrans",708,"Sí","Polivulnerabilitat baixa","No","Alta","Baixa","Normal","Mitjana","A",68.581999999999994]
[null,null,null,null,"Quartell",null,null,"Dos Aguas","46115","València","La Foia de Bunyol",376,"Sí","Polivulnerabilitat mitjana","Sí","Baixa","Mitjana","Normal","-","A",121.51]
[null,null,null,null,"Quatretonda",null,null,"Eliana, l'","46116","València","El Camp de Túria",18235,"No","Vulnerabilitat residual","No","Mitjana","Baixa","Alt","Baixa","C-2",8.7720000000000002]
[null,null,null,null,"Quatretondeta",null,null,"Emperador","46117","València","L'Horta Nord",687,"No","Polivulnerabilitat baixa","No","Baixa","Mitjana","Alt","-","C-2",2.5999999999999999E-2]
[null,null,null,null,"Quesa",null,null,"Enguera","46118","València","La Canal de Navarrés",4752,"No","Vulnerabilitat residual","No","Mitjana","Mitjana","Normal","-","A",241.749]
[null,null,null,null,"Rafal",null,null,"Énova, l'","46119","València","La Ribera Alta",887,"No","Polivulnerabilitat baixa","No","Baixa","Alta","Normal","-","A",7.6740000000000004]
[null,null,null,null,"Rafelbunyol",null,null,"Estivella","46120","València","El Camp de Morvedre",1456,"No","Vulnerabilitat residual","No","Mitjana","Baixa","Normal","-","A",20.917000000000002]
[null,null,null,null,"Rafelcofer",null,null,"Estubeny","46121","València","La Costera",121,"Sí","Polivulnerabilitat baixa","No","Baixa","Alta","Normal","-","A",6.4180000000000001]
[null,null,null,null,"Rafelguaraf",null,null,"Faura","46122","València","El Camp de Morvedre",3538,"No","Vulnerabilitat residual","No","Mitjana","Baixa","Normal","-","A",1.6359999999999999]
[null,null,null,null,"Ràfol d'Almúnia, el",null,null,"Favara","46123","València","La Ribera Baixa",2518,"No","Vulnerabilitat residual","No","Alta","Alta","Normal","Mitjana","A",9.4540000000000006]
[null,null,null,null,"Ráfol de Salem",null,null,"Fontanars dels Alforins","46124","València","La Vall d'Albaida",971,"No","Polivulnerabilitat baixa","No","Baixa","Mitjana","Normal","-","A",74.688000000000002]
[null,null,null,null,"Real",null,null,"Fortaleny","46125","València","La Ribera Baixa",1026,"No","Polivulnerabilitat baixa","No","Alta","Alta","Normal","-","A",4.5679999999999996]
[null,null,null,null,"Real de Gandia, el",null,null,"Foios","46126","València","L'Horta Nord",7367,"No","Vulnerabilitat residual","No","Mitjana","Mitjana","Alt","Mitjana","C-1",6.48]
[null,null,null,null,"Redován",null,null,"Font d'En Carròs, la","46127","València","La Safor",3794,"No","Vulnerabilitat residual","No","Alta","Alta","Normal","Mitjana","A",9.8979999999999997]
[null,null,null,null,"Relleu",null,null,"Font de la Figuera, la","46128","València","La Costera",2038,"No","Vulnerabilitat residual","No","Baixa","Mitjana","Normal","-","A",84.335999999999999]
[null,null,null,null,"Requena",null,null,"Fuenterrobles","46129","València","La Plana d'Utiel-Requena",682,"No","Vulnerabilitat residual","No","Baixa","Baixa","Normal","-","A",49.453000000000003]
[null,null,null,null,"Riba-roja de Túria",null,null,"Gavarda","46130","València","La Ribera Alta",1038,"No","Polivulnerabilitat baixa","No","Mitjana","Alta","Normal","-","A",7.9870000000000001]
[null,null,null,null,"Ribesalbes",null,null,"Gandia","46131","València","La Safor",74562,"No","Polivulnerabilitat baixa","No","Alta","Alta","Alt","Alta","B",60.835000000000001]
[null,null,null,null,"Riola",null,null,"Genovés, el","46132","València","La Costera",2842,"No","Vulnerabilitat residual","No","Alta","Mitjana","Normal","Baixa","A",15.162000000000001]
[null,null,null,null,"Rocafort",null,null,"Gestalgar","46133","València","Els Serrans",556,"Sí","Polivulnerabilitat baixa","No","Alta","Baixa","Normal","-","A",69.731999999999999]
[null,null,null,null,"Rojales",null,null,"Gilet","46134","València","El Camp de Morvedre",3324,"No","Vulnerabilitat residual","No","Mitjana","Baixa","Normal","-","A",11.282]
[null,null,null,null,"Romana, la",null,null,"Godella","46135","València","L'Horta Nord",13088,"No","Vulnerabilitat residual","No","Mitjana","Mitjana","Alt","Baixa","C-1",8.4030000000000005]
[null,null,null,null,"Rossell",null,null,"Godelleta","46136","València","La Foia de Bunyol",3533,"No","Vulnerabilitat residual","No","Mitjana","Mitjana","Normal","Baixa","A",37.451000000000001]
[null,null,null,null,"Rotglà i Corberà",null,null,"Granja de la Costera, la","46137","València","La Costera",285,"No","Vulnerabilitat residual","No","Baixa","Alta","Normal","-","A",0.83099999999999996]
[null,null,null,null,"Rótova",null,null,"Guadasséquies","46138","València","La Vall d'Albaida",468,"No","Polivulnerabilitat baixa","No","Baixa","Mitjana","Normal","-","A",3.26]
[null,null,null,null,"Rugat",null,null,"Guadassuar","46139","València","La Ribera Alta",5893,"No","Polivulnerabilitat baixa","No","Alta","Alta","Normal","-","A",35.340000000000003]
[null,null,null,null,"Sacañet",null,null,"Guardamar de la Safor","46140","València","La Safor",526,"No","Vulnerabilitat residual","No","Alta","Alta","Normal","-","A",1.099]
[null,null,null,null,"Sagra",null,null,"Higueruelas","46141","València","Els Serrans",500,"Sí","Vulnerabilitat residual","No","Mitjana","Baixa","Normal","-","A",18.797999999999998]
[null,null,null,null,"Sagunt",null,null,"Jalance","46142","València","La Vall de Cofrents-Aiora",830,"Sí","Polivulnerabilitat baixa","No","Baixa","Mitjana","Normal","-","A",94.769000000000005]
[null,null,null,null,"Salem",null,null,"Xeraco","46143","València","La Safor",5655,"No","Polivulnerabilitat baixa","No","Alta","Mitjana","Normal","Mitjana","A",20.216000000000001]
[null,null,null,null,"Salinas",null,null,"Jarafuel","46144","València","La Vall de Cofrents-Aiora",754,"Sí","Vulnerabilitat integral","Sí","Baixa","Mitjana","Normal","-","A",103.092]
[null,null,null,null,"Salzadella, la",null,null,"Xàtiva","46145","València","La Costera",29231,"No","Vulnerabilitat residual","No","Baixa","Alta","Normal","Mitjana","C-1",76.563999999999993]
[null,null,null,null,"San Antonio de Benagéber",null,null,"Xeresa","46146","València","La Safor",2168,"No","Polivulnerabilitat baixa","No","Alta","Mitjana","Normal","Baixa","A",16.846]
[null,null,null,null,"San Fulgencio",null,null,"Llíria","46147","València","El Camp de Túria",23253,"No","Vulnerabilitat residual","No","Mitjana","Baixa","Normal","Mitjana","A",227.977]
[null,null,null,null,"San Isidro",null,null,"Loriguilla","46148","València","El Camp de Túria",2025,"No","Vulnerabilitat residual","No","Alta","Baixa","Alt","-","C-1",72.421000000000006]
[null,null,null,null,"San Miguel de Salinas",null,null,"Losa del Obispo","46149","València","Els Serrans",507,"Sí","Polivulnerabilitat mitjana","No","Baixa","Mitjana","Normal","-","A",12.167]
[null,null,null,null,"San Rafael del Río",null,null,"Llutxent","46150","València","La Vall d'Albaida",2345,"No","Polivulnerabilitat baixa","No","Mitjana","Mitjana","Normal","-","A",40.118000000000002]
[null,null,null,null,"Sanet y Negrals",null,null,"Llocnou d'en Fenollet","46151","València","La Costera",916,"No","Vulnerabilitat residual","No","Baixa","Mitjana","Normal","-","A",1.532]
[null,null,null,null,"Sant Joan d'Alacant",null,null,"Llocnou de la Corona","46152","València","L'Horta Sud",118,"Sí","Vulnerabilitat integral","Sí","Mitjana","Alta","Alt","-","A",4.2000000000000003E-2]
[null,null,null,null,"Sant Joan de Moró",null,null,"Llocnou de Sant Jeroni","46153","València","La Safor",546,"No","Vulnerabilitat residual","No","Alta","Alta","Normal","-","C-1",6.4729999999999999]
[null,null,null,null,"Sant Joanet",null,null,"Llanera de Ranes","46154","València","La Costera",1055,"No","Polivulnerabilitat mitjana","Sí","Baixa","Alta","Normal","-","A",9.2739999999999991]
[null,null,null,null,"Sant Jordi",null,null,"Llaurí","46155","València","La Ribera Baixa",1170,"Sí","Polivulnerabilitat mitjana","Sí","Alta","Alta","Normal","-","A",13.625999999999999]
[null,null,null,null,"Sant Mateu",null,null,"Llombai","46156","València","La Ribera Alta",2685,"No","Polivulnerabilitat baixa","No","Mitjana","Mitjana","Normal","Baixa","A",55.575000000000003]
[null,null,null,null,"Sant Vicent del Raspeig",null,null,"Llosa de Ranes, la","46157","València","La Costera",3575,"No","Polivulnerabilitat baixa","No","Mitjana","Alta","Normal","-","A",7.1260000000000003]
[null,null,null,null,"Santa Magdalena de Pulpis",null,null,"Macastre","46158","València","La Foia de Bunyol",1283,"No","Polivulnerabilitat baixa","No","Mitjana","Mitjana","Alt","-","A",37.655000000000001]
[null,null,null,null,"Santa Pola",null,null,"Manises","46159","València","L'Horta Oest",30919,"No","Polivulnerabilitat baixa","No","Alta","Mitjana","Alt","Alta","A",19.652999999999999]
[null,null,null,null,"Sax",null,null,"Manuel","46160","València","La Ribera Alta",2428,"No","Vulnerabilitat residual","No","Alta","Alta","Alt","-","B",6.048]
[null,null,null,null,"Sedaví",null,null,"Marines","46161","València","El Camp de Túria",1828,"No","Vulnerabilitat residual","No","Baixa","Baixa","Normal","Mitjana","A",35.722999999999999]
[null,null,null,null,"Segart",null,null,"Massalavés","46162","València","La Ribera Alta",1596,"No","Vulnerabilitat integral","Sí","Baixa","Alta","Normal","Alta","A",7.484]
[null,null,null,null,"Segorbe",null,null,"Massalfassar","46163","València","L'Horta Nord",2469,"No","Vulnerabilitat residual","No","Mitjana","Mitjana","Alt","-","A",2.5339999999999998]
[null,null,null,null,"Sella",null,null,"Massamagrell","46164","València","L'Horta Nord",15952,"No","Polivulnerabilitat baixa","No","Alta","Mitjana","Alt","Alta","C-2",6.1630000000000003]
[null,null,null,null,"Sellent",null,null,"Massanassa","46165","València","L'Horta Sud",9667,"No","Vulnerabilitat residual","No","Alta","Mitjana","Alt","Mitjana","C-2",5.5919999999999996]
[null,null,null,null,"Sempere",null,null,"Meliana","46166","València","L'Horta Nord",10822,"No","Vulnerabilitat residual","No","Baixa","Mitjana","Alt","Mitjana","C-2",4.7329999999999997]
[null,null,null,null,"Senija",null,null,"Millares","46167","València","La Canal de Navarrés",345,"Sí","Polivulnerabilitat mitjana","Sí","Baixa","Alta","Normal","-","C-1",105.50700000000001]
[null,null,null,null,"Senyera",null,null,"Miramar","46168","València","La Safor",2634,"No","Vulnerabilitat residual","No","Alta","Alta","Normal","Baixa","A",2.556]
[null,null,null,null,"Serra",null,null,"Mislata","46169","València","L'Horta Oest",43691,"No","Vulnerabilitat residual","No","Baixa","Mitjana","Alt","Mitjana","A",2.032]
[null,null,null,null,"Serratella, la",null,null,"Moixent","46170","València","La Costera",4302,"No","Polivulnerabilitat baixa","No","Alta","Mitjana","Normal","Baixa","B",150.22800000000001]
[null,null,null,null,"Sierra Engarcerán",null,null,"Moncada","46171","València","L'Horta Nord",21935,"No","Polivulnerabilitat baixa","No","Mitjana","Mitjana","Alt","Alta","A",15.827999999999999]
[null,null,null,null,"Siete Aguas",null,null,"Montserrat","46172","València","La Ribera Alta",7878,"No","Vulnerabilitat residual","No","Baixa","Mitjana","Normal","Baixa","C-1",45.575000000000003]
[null,null,null,null,"Silla",null,null,"Montaverner","46173","València","La Vall d'Albaida",1630,"No","Polivulnerabilitat baixa","No","Mitjana","Mitjana","Normal","-","A",7.3979999999999997]
[null,null,null,null,"Simat de la Valldigna",null,null,"Montesa","46174","València","La Costera",1164,"No","Polivulnerabilitat baixa","No","Baixa","Alta","Normal","-","A",48.113]
[null,null,null,null,"Sinarcas",null,null,"Montitxelvo","46175","València","La Vall d'Albaida",584,"No","Polivulnerabilitat baixa","No","Baixa","Alta","Normal","-","A",8.1649999999999991]
[null,null,null,null,"Sollana",null,null,"Montroi","46176","València","La Ribera Alta",2867,"No","Vulnerabilitat residual","No","Alta","Mitjana","Normal","Baixa","A",31.390999999999998]
[null,null,null,null,"Soneja",null,null,"Museros","46177","València","L'Horta Nord",6458,"No","Vulnerabilitat residual","No","Mitjana","Mitjana","Alt","Mitjana","A",12.454000000000001]
[null,null,null,null,"Sot de Chera",null,null,"Nàquera","46178","València","El Camp de Túria",6577,"No","Vulnerabilitat residual","No","Mitjana","Baixa","Alt","Baixa","C-2",38.706000000000003]
[null,null,null,null,"Sot de Ferrer",null,null,"Navarrés","46179","València","La Canal de Navarrés",2968,"No","Polivulnerabilitat baixa","No","Mitjana","Mitjana","Normal","-","A",47.039000000000001]
[null,null,null,null,"Sueca",null,null,"Novetlè","46180","València","La Costera",837,"No","Vulnerabilitat residual","No","Baixa","Alta","Normal","-","A",1.472]
[null,null,null,null,"Suera",null,null,"Oliva","46181","València","La Safor",25101,"No","Polivulnerabilitat baixa","No","Alta","Mitjana","Normal","Mitjana","A",59.929000000000002]
[null,null,null,null,"Sumacàrcer",null,null,"Olocau","46182","València","El Camp de Túria",1771,"No","Polivulnerabilitat baixa","No","Mitjana","Baixa","Normal","-","C-1",37.396999999999998]
[null,null,null,null,"Tales",null,null,"Olleria, l'","46183","València","La Vall d'Albaida",8281,"No","Vulnerabilitat residual","No","Mitjana","Alta","Normal","Mitjana","A",32.225000000000001]
[null,null,null,null,"Tàrbena",null,null,"Ontinyent","46184","València","La Vall d'Albaida",35347,"No","Polivulnerabilitat baixa","No","Alta","Alta","Normal","Mitjana","A",125.43]
[null,null,null,null,"Tavernes Blanques",null,null,"Otos","46185","València","La Vall d'Albaida",434,"No","Polivulnerabilitat baixa","No","Baixa","Alta","Normal","-","C-1",11.068]
[null,null,null,null,"Tavernes de la Valldigna",null,null,"Paiporta","46186","València","L'Horta Sud",26088,"No","Vulnerabilitat residual","No","Alta","Mitjana","Alt","Alta","A",3.9569999999999999]
[null,null,null,null,"Teresa",null,null,"Palma de Gandía","46187","València","La Safor",1631,"No","Polivulnerabilitat baixa","No","Alta","Alta","Normal","Baixa","C-1",13.920999999999999]
[null,null,null,null,"Teresa de Cofrentes",null,null,"Palmera","46188","València","La Safor",1024,"No","Vulnerabilitat residual","No","Alta","Mitjana","Normal","-","A",0.97799999999999998]
[null,null,null,null,"Terrateig",null,null,"Palomar, el","46189","València","La Vall d'Albaida",590,"No","Vulnerabilitat residual","No","Baixa","Alta","Normal","-","A",7.758]
[null,null,null,null,"Teulada",null,null,"Paterna","46190","València","L'Horta Oest",70195,"No","Vulnerabilitat residual","No","Mitjana","Mitjana","Alt","Alta","A",35.850999999999999]
[null,null,null,null,"Tibi",null,null,"Pedralba","46191","València","Els Serrans",2778,"Sí","Polivulnerabilitat baixa","No","Alta","Baixa","Normal","Baixa","B",58.845999999999997]
[null,null,null,null,"Tírig",null,null,"Petrés","46192","València","El Camp de Morvedre",997,"No","Vulnerabilitat residual","No","Baixa","Baixa","Normal","-","A",1.875]
[null,null,null,null,"Titaguas",null,null,"Picanya","46193","València","L'Horta Oest",11513,"No","Vulnerabilitat residual","No","Alta","Mitjana","Alt","Alta","A",7.1989999999999998]
[null,null,null,null,"Todolella",null,null,"Picassent","46194","València","L'Horta Sud",20942,"No","Vulnerabilitat residual","No","Mitjana","Mitjana","Alt","Alta","B",85.786000000000001]
[null,null,null,null,"Toga",null,null,"Piles","46195","València","La Safor",2685,"No","Polivulnerabilitat baixa","No","Alta","Alta","Normal","Baixa","C-1",3.9409999999999998]
[null,null,null,null,"Tollos",null,null,"Pinet","46196","València","La Vall d'Albaida",157,"Sí","Polivulnerabilitat mitjana","Sí","Baixa","Alta","Normal","-","A",11.888999999999999]
[null,null,null,null,"Torás",null,null,"Polinyà de Xúquer","46197","València","La Ribera Baixa",2472,"No","Polivulnerabilitat baixa","No","Alta","Mitjana","Normal","Baixa","A",9.1769999999999996]
[null,null,null,null,"Tormos",null,null,"Potries","46198","València","La Safor",1046,"No","Polivulnerabilitat baixa","No","Baixa","Alta","Normal","Mitjana","A",3.0720000000000001]
[null,null,null,null,"Toro, El",null,null,"Pobla de Farnals, la","46199","València","L'Horta Nord",7978,"No","Vulnerabilitat residual","No","Alta","Mitjana","Alt","Mitjana","A",3.6150000000000002]
[null,null,null,null,"Torralba del Pinar",null,null,"Pobla del Duc, la","46200","València","La Vall d'Albaida",2543,"No","Vulnerabilitat residual","No","Baixa","Mitjana","Alt","-","C-2",18.869]
[null,null,null,null,"Torre de les Maçanes, la",null,null,"Puebla de San Miguel","46201","València","El Racó d'Ademús",62,"Sí","Vulnerabilitat residual","No","Baixa","Mitjana","Normal","-","A",63.581000000000003]
[null,null,null,null,"Torre d'En Besora, la",null,null,"Pobla de Vallbona, la","46202","València","El Camp de Túria",24433,"No","Vulnerabilitat residual","No","Mitjana","Baixa","Alt","Alta","A",33.103999999999999]
[null,null,null,null,"Torre d'en Doménec, la",null,null,"Pobla Llarga, la","46203","València","La Ribera Alta",4452,"No","Vulnerabilitat residual","No","Mitjana","Alta","Normal","Baixa","C-2",10.093]
[null,null,null,null,"Torrebaja",null,null,"Puig de Santa Maria, el","46204","València","L'Horta Nord",8630,"No","Vulnerabilitat residual","No","Alta","Mitjana","Alt","Alta","A",26.827000000000002]
[null,null,null,null,"Torreblanca",null,null,"Puçol","46205","València","L'Horta Nord",19495,"No","Vulnerabilitat residual","No","Alta","Mitjana","Alt","Baixa","C-1",18.059999999999999]
[null,null,null,null,"Torrechiva",null,null,"Quesa","46206","València","La Canal de Navarrés",670,"Sí","Polivulnerabilitat mitjana","Sí","Baixa","Alta","Normal","-","C-1",73.159000000000006]
[null,null,null,null,"Torrella",null,null,"Rafelbunyol","46207","València","L'Horta Nord",8941,"No","Polivulnerabilitat baixa","No","Alta","Mitjana","Alt","Mitjana","A",4.1980000000000004]
[null,null,null,null,"Torrent",null,null,"Rafelcofer","46208","València","La Safor",1345,"No","Vulnerabilitat residual","No","Alta","Alta","Normal","Baixa","C-2",2.0329999999999999]
[null,null,null,null,"Torres Torres",null,null,"Rafelguaraf","46209","València","La Ribera Alta",2335,"No","Vulnerabilitat residual","No","Alta","Alta","Normal","-","A",16.262]
[null,null,null,null,"Torrevieja",null,null,"Ráfol de Salem","46210","València","La Vall d'Albaida",462,"No","Polivulnerabilitat baixa","No","Baixa","Mitjana","Normal","-","A",4.3250000000000002]
[null,null,null,null,"Tous",null,null,"Real de Gandia, el","46211","València","La Safor",2461,"No","Vulnerabilitat residual","No","Alta","Mitjana","Normal","Mitjana","A",6.0720000000000001]
[null,null,null,null,"Traiguera",null,null,"Real","46212","València","La Ribera Alta",2154,"No","Polivulnerabilitat baixa","No","Mitjana","Mitjana","Normal","Baixa","A",18.315000000000001]
[null,null,null,null,"Tuéjar",null,null,"Requena","46213","València","La Plana d'Utiel-Requena",20254,"No","Polivulnerabilitat baixa","No","Mitjana","Baixa","Normal","Alta","A",814.20899999999995]
[null,null,null,null,"Turís",null,null,"Riba-roja de Túria","46214","València","El Camp de Túria",22264,"No","Vulnerabilitat residual","No","Mitjana","Mitjana","Alt","Alta","C-1",57.488]
[null,null,null,null,"Useres, les",null,null,"Riola","46215","València","La Ribera Baixa",1759,"No","Polivulnerabilitat baixa","No","Alta","Alta","Normal","-","C-2",5.59]
[null,null,null,null,"Utiel",null,null,"Rocafort","46216","València","L'Horta Nord",7240,"No","Vulnerabilitat residual","No","Mitjana","Mitjana","Alt","Baixa","A",2.3410000000000002]
[null,null,null,null,"València",null,null,"Rotglà i Corberà","46217","València","La Costera",1138,"No","Vulnerabilitat residual","No","Mitjana","Alta","Normal","-","C-1",6.2569999999999997]
[null,null,null,null,"Vall d'Alba",null,null,"Rótova","46218","València","La Safor",1294,"No","Polivulnerabilitat baixa","No","Mitjana","Mitjana","Normal","-","A",7.6559999999999997]
[null,null,null,null,"Vall d'Alcalà, la",null,null,"Rugat","46219","València","La Vall d'Albaida",158,"No","Vulnerabilitat residual","No","Baixa","Mitjana","Normal","-","A",3.2040000000000002]
[null,null,null,null,"Vall de Almonacid",null,null,"Sagunt","46220","València","El Camp de Morvedre",66140,"No","Polivulnerabilitat baixa","No","Alta","Baixa","Alt","Alta","A",132.37]
[null,null,null,null,"Vall de Gallinera",null,null,"Salem","46221","València","La Vall d'Albaida",424,"No","Vulnerabilitat residual","No","Mitjana","Mitjana","Normal","-","B",8.6050000000000004]
[null,null,null,null,"Vall de Laguar, la",null,null,"Sant Joanet","46222","València","La Ribera Alta",504,"No","Polivulnerabilitat baixa","No","Baixa","Alta","Normal","Mitjana","A",1.8580000000000001]
[null,null,null,null,"Vall d'Ebo, la",null,null,"Sedaví","46223","València","L'Horta Sud",10333,"No","Vulnerabilitat residual","No","Mitjana","Mitjana","Alt","Mitjana","A",1.833]
[null,null,null,null,"Vall d'Uixó, la",null,null,"Segart","46224","València","El Camp de Morvedre",163,"No","Vulnerabilitat residual","No","Mitjana","Baixa","Normal","-","B",6.6440000000000001]
[null,null,null,null,"Vallada",null,null,"Sellent","46225","València","La Ribera Alta",389,"No","Vulnerabilitat residual","No","Alta","Alta","Normal","-","A",14.005000000000001]
[null,null,null,null,"Vallanca",null,null,"Sempere","46226","València","La Vall d'Albaida",34,"Sí","Polivulnerabilitat mitjana","Sí","Baixa","Alta","Normal","-","A",3.8260000000000001]
[null,null,null,null,"Vallat",null,null,"Senyera","46227","València","La Ribera Alta",1136,"No","Vulnerabilitat residual","No","Alta","Alta","Normal","Mitjana","A",2.0310000000000001]
[null,null,null,null,"Vallés",null,null,"Serra","46228","València","El Camp de Túria",3124,"No","Vulnerabilitat residual","No","Baixa","Baixa","Normal","-","A",57.295000000000002]
[null,null,null,null,"Vallibona",null,null,"Siete Aguas","46229","València","La Foia de Bunyol",1154,"No","Vulnerabilitat residual","No","Mitjana","Mitjana","Normal","Baixa","A",110.595]
[null,null,null,null,"Venta del Moro",null,null,"Silla","46230","València","L'Horta Sud",18771,"No","Polivulnerabilitat mitjana","Sí","Mitjana","Mitjana","Alt","Alta","A",25.018999999999998]
[null,null,null,null,"Verger, el",null,null,"Simat de la Valldigna","46231","València","La Safor",3329,"No","Polivulnerabilitat baixa","No","Mitjana","Alta","Alt","Baixa","C-1",38.488]
[null,null,null,null,"Vila Joiosa, la",null,null,"Sinarcas","46232","València","La Plana d'Utiel-Requena",1125,"No","Vulnerabilitat residual","No","Mitjana","Baixa","Normal","-","A",102.461]
[null,null,null,null,"Vilafamés",null,null,"Sollana","46233","València","La Ribera Baixa",4861,"No","Vulnerabilitat residual","No","Alta","Alta","Normal","Alta","A",39.22]
[null,null,null,null,"Vilafranca",null,null,"Sot de Chera","46234","València","Els Serrans",369,"Sí","Vulnerabilitat residual","No","Alta","Baixa","Normal","Mitjana","A",38.750999999999998]
[null,null,null,null,"Vilallonga",null,null,"Sueca","46235","València","La Ribera Baixa",27479,"No","Vulnerabilitat residual","No","Alta","Alta","Normal","-","A",92.516000000000005]
[null,null,null,null,"Vilamarxant",null,null,"Sumacàrcer","46236","València","La Ribera Alta",1096,"No","Polivulnerabilitat mitjana","No","Alta","Alta","Normal","-","C-1",20.09]
[null,null,null,null,"Vilanova d'Alcolea",null,null,"Tavernes Blanques","46237","València","L'Horta Nord",9120,"No","Polivulnerabilitat baixa","No","Mitjana","Mitjana","Alt","Alta","A",0.73599999999999999]
[null,null,null,null,"Vilar de Canes",null,null,"Tavernes de la Valldigna","46238","València","La Safor",17201,"No","Vulnerabilitat residual","No","Alta","Alta","Normal","Alta","C-1",49.232999999999997]
[null,null,null,null,"Vila-real",null,null,"Teresa de Cofrentes","46239","València","La Vall de Cofrents-Aiora",636,"Sí","Polivulnerabilitat mitjana","Sí","Baixa","Mitjana","Normal","-","A",110.804]
[null,null,null,null,"Vilavella, la",null,null,"Terrateig","46240","València","La Vall d'Albaida",278,"No","Polivulnerabilitat mitjana","No","Mitjana","Alta","Normal","-","A",6.3159999999999998]
[null,null,null,null,"Villahermosa del Río",null,null,"Titaguas","46241","València","Els Serrans",453,"Sí","Vulnerabilitat residual","No","Baixa","Mitjana","Normal","-","A",63.213000000000001]
[null,null,null,null,"Villamalur",null,null,"Torrebaja","46242","València","El Racó d'Ademús",411,"Sí","Polivulnerabilitat baixa","No","Alta","Baixa","Normal","Mitjana","A",4.7169999999999996]
[null,null,null,null,"Villanueva de Viver",null,null,"Torrella","46243","València","La Costera",146,"No","Polivulnerabilitat mitjana","Sí","Baixa","Alta","Normal","-","A",1.145]
[null,null,null,null,"Villar del Arzobispo",null,null,"Torrent","46244","València","L'Horta Oest",82208,"No","Polivulnerabilitat mitjana","Sí","Mitjana","Mitjana","Alt","Alta","A",69.234999999999999]
[null,null,null,null,"Villargordo del Cabriel",null,null,"Torres Torres","46245","València","El Camp de Morvedre",637,"No","Vulnerabilitat residual","No","Baixa","Baixa","Normal","-","B",11.772]
[null,null,null,null,"Villena",null,null,"Tous","46246","València","La Ribera Alta",1263,"No","Polivulnerabilitat baixa","No","Alta","Alta","Normal","Mitjana","A",127.524]
[null,null,null,null,"Villores",null,null,"Tuéjar","46247","València","Els Serrans",1116,"Sí","Polivulnerabilitat baixa","No","Mitjana","Mitjana","Normal","-","A",121.923]
[null,null,null,null,"Vinalesa",null,null,"Turís","46248","València","La Ribera Alta",6646,"No","Vulnerabilitat residual","No","Baixa","Mitjana","Normal","Baixa","A",80.504999999999995]
[null,null,null,null,"Vinaròs",null,null,"Utiel","46249","València","La Plana d'Utiel-Requena",11531,"No","Polivulnerabilitat baixa","No","Alta","Baixa","Normal","Mitjana","A",236.91300000000001]
[null,null,null,null,"Vistabella del Maestrat",null,null,"València","46250","València","València",794288,"No","Vulnerabilitat residual","No","Mitjana","Mitjana","Alt","Alta","A-1",139.315]
[null,null,null,null,"Viver",null,null,"Vallada","46251","València","La Costera",3039,"No","Vulnerabilitat residual","No","Mitjana","Alta","Normal","Baixa","C-1",61.497]
[null,null,null,null,"Xàbia",null,null,"Vallanca","46252","València","El Racó d'Ademús",139,"Sí","Polivulnerabilitat mitjana","Sí","Baixa","Baixa","Normal","Alta","A",56.61]
[null,null,null,null,"Xaló",null,null,"Vallés","46253","València","La Costera",157,"No","Polivulnerabilitat mitjana","Sí","Alta","Alta","Normal","-","A",1.2350000000000001]
[null,null,null,null,"Xàtiva",null,null,"Venta del Moro","46254","València","La Plana d'Utiel-Requena",1207,"Sí","Polivulnerabilitat mitjana","Sí","Mitjana","Baixa","Normal","Baixa","A",272.58800000000002]
[null,null,null,null,"Xeraco",null,null,"Villalonga","46255","València","La Safor",4270,"No","Vulnerabilitat residual","No","Alta","Mitjana","Normal","Baixa","A",43.317999999999998]
[null,null,null,null,"Xeresa",null,null,"Vilamarxant","46256","València","El Camp de Túria",9717,"No","Vulnerabilitat residual","No","Mitjana","Mitjana","Normal","Alta","A",71.08]
[null,null,null,null,"Xert",null,null,"Castelló","46257","València","La Ribera Alta",7049,"No","Vulnerabilitat residual","No","Alta","Alta","Normal","Alta","A",20.303000000000001]
[null,null,null,null,"Xilxes",null,null,"Villar del Arzobispo","46258","València","Els Serrans",3554,"Sí","Polivulnerabilitat baixa","No","Baixa","Baixa","Normal","Baixa","A",40.704999999999998]
[null,null,null,null,"Xirivella",null,null,"Villargordo del Cabriel","46259","València","La Plana d'Utiel-Requena",589,"Sí","Polivulnerabilitat baixa","No","Baixa","Baixa","Normal","-","A",71.61]
[null,null,null,null,"Xixona",null,null,"Vinalesa","46260","València","L'Horta Nord",3420,"No","Vulnerabilitat residual","No","Alta","Mitjana","Alt","Baixa","A",1.5289999999999999]
[null,null,null,null,"Xodos",null,null,"Yátova","46261","València","La Foia de Bunyol",2067,"No","Vulnerabilitat residual","No","Baixa","Mitjana","Normal","-","C-2",120.24]
[null,null,null,null,"Yátova",null,null,"Yesa, La","46262","València","Els Serrans",229,"Sí","Polivulnerabilitat baixa","No","Baixa","Baixa","Normal","-","A",84.674999999999997]
[null,null,null,null,"Yesa, La",null,null,"Zarra","46263","València","La Vall de Cofrents-Aiora",359,"Sí","Polivulnerabilitat mitjana","Sí","Mitjana","Mitjana","Normal","-","A",49.718000000000004]
[null,null,null,null,"Zarra",null,null,"Gátova","46902","València","El Camp de Túria",378,"Sí","Polivulnerabilitat mitjana","Sí","Baixa","Baixa","Normal","-","A",30.411999999999999]
[null,null,null,null,"Zorita del Maestrazgo",null,null,"San Antonio de Benagéber","46903","València","El Camp de Túria",9089,"No","Vulnerabilitat residual","No","Baixa","Baixa","Alt","Baixa","C-2",8.7409999999999997]
[null,null,null,null,"Zucaina",null,null,"Benicull de Xúquer","46904","València","La Ribera Baixa",1012,"No","Polivulnerabilitat baixa","No","Alta",null,"Normal","-","A",3.4969999999999999]